Kernel 6.00 Test Week

More information about the event can be found here: http://fedoraproject.org/wiki/Test_Day:2022-10-16_Kernel_6.0_Test_Week
Go back to List of Events.

Results

Clicking on the testcase name will show you the appropriate "how to test" page.
Click on the Enter result button, to enter result.
Note: results are cached and realoaded from the database each 10 seconds.

Regression Test

Username Profile Regression Comments
Enter result
Daniels Fedora WS 37 Beta VM Live (Test : KVM QEMU Standard PC _Q35 + ICH9, 2009_ Intel® Celeron® N5105 × 4 Gnome 42.4) [1] 1. Both Regression Test and Performance = PASS
JerrySM64 Fedora 37 running on MSI B550 Gaming Plus, AMD Ryzen 5 3600, 16 GB DDR4 2133 and AMD RX 6650 XT [1] 1. Other than a couple of warnings, the script showed me at the beginning of the performance test, everything ran through like a breeze. I couldn't find any unresponsiveness, error or crash till now.
JerrySM64 https://accounts.fedoraproject.org/user/jerrysm64/ [1] 1. Other than a couple of warnings, the script showed me at the beginning of the performance test, everything ran through like a breeze. I couldn't find any unresponsiveness, error or crash till now.
Linuxguy123@gmail.com None [1] 1. https://bugzilla.redhat.com/show_bug.cgi?id=2107763 I did not run the regression tests.
Nicosss https://linux-hardware.org/?probe=e0c8c2fe15 [1] 1. Both runs of the test suite result in PASS. Vulnerability status: /sys/devices/system/cpu/vulnerabilities/itlb_multihit:Not affected ; /sys/devices/system/cpu/vulnerabilities/l1tf:Not affected ; /sy s/devices/system/cpu/vulnerabilities/mds:Not affected ; /sys/devices/system/cpu/vulnerabilities/meltdown:Not affected ; /sys/devices/system/cpu/vulnerabilities/mmio_stale_data:Not affected ; /sys/devices/system/cpu/vulnerabilities/retbleed:Mitigation: untrained return thunk; SMT vulnerable ; /sys/devices/system/cpu/vulnerabilities/spec_store_bypass:Mitigation: Speculative Store Bypass disabled via prctl ; /sys/devices/system/cpu/vulnerabilities/spectre_v1:Mitigation: usercopy/swapgs barriers and __user pointer sanitization ; /sys/devices/system/cpu/vulnerabilities/spectre_v2:Mitigation: Retpolines, STIBP: disabled, RSB filling, PBRSB-eIBRS: Not affected ; /sys/devices/system/cpu/vulnerabilities/srbds:Not affected ; /sys/devices/system/cpu/vulnerabilities/tsx_async_abort:Not affected
Shuichi Aoki CPU:AMD Ryzen 9 5950X. mother:ASUS TUF GAMING X570-PULS. memory:64Gbyte. os:F36 test day image. [1] 1. default test passed:performance test passed
Spockfish XPS 17 9700, Intel i9-10885H (16) @ 5.300GHz, Intel CometLake-H GT2 [UHD Graphics], NVIDIA GeForce RTX 2060 Max-Q
TTabakov Laptop > SUSTeK Computer Inc. K53SK , RAM 16.0 GiB, CPU > Intel® Core™ i5-2450M × 4, GPU > AMD TURKS / Mesa Intel® HD Graphics 3000 (SNB GT2), SSD 120 .0 GB, OS > Fedora Linux 36 64bit(Workstation Edition), [1] 1. Tested with > kernel-6.0.2-301.fc36 Test 1 PASSED all except > ./default/libhugetlbfs SKIP ./default/paxtest SKIP TEST 2 too quite long, but all PASSED
VladimirSokolenko QEMU emulator version 6.2.0 (qemu-6.2.0-15.fc36), kerneltest-6.0.2 VM image, host machine: Hp ProBook 640 G8 [1] 1. Kernel: 6.0.2-300.fc36.x86_64 Release: Fedora release 36 (Thirty Six) Result: PASS Failed Tests: None Warned Tests: None
aalam 1. AMD Ryzen 7 5800X + X570 2. AMD Ryzen 7 PRO 5850U [1] 1. runtests.sh performance PASSED on both machines
aalam AMD Ryzen 7 5800X + X570 [1] 1. kernel test with 'performance'
abdinaser
abt8601 Dell Inspiron 13 5320, Intel Core i7-1260P, Kernel 6.0.2-301.fc36.x86_64, https://linux-hardware.org/?probe=9ac52708ad [1] 1. Regression and performance tests passed.
adamthiede Fedora 36 on Thinkpad X230 w/coreboot [1] 1. 6.0.2-300.fc36.x86_64 pass or skip all tests; warned on sysfs perms
akoster Fedora 37 Beta LXDE Spin and Fedora 36 LXDE in VirtualBox 6.1 [1] 1. All tests passed (performance and regular tests) for Fedora 36 and Fedora 37 Beta in VirtualBox 6.1 using the LXDE ISO spins
akoster Fedora 37 Beta LXDE Spin in VirtualBox 6.1 [1] 1. Basic and Performance kernel tests passed
alciregi Pinebook Pro aarch64 [1] 1. Default test suite
alciregi Raspberry Pi 4 aarch64 [1] 1. Vulnerability status: /sys/devices/system/cpu/vulnerabilities/itlb_multihit:Not affected /sys/devices/system/cpu/vulnerabilities/l1tf:Not affected /sys/devices/system/cpu/vulnerabilities/mds:Not af fected /sys/devices/system/cpu/vulnerabilities/meltdown:Not affected /sys/devices/system/cpu/vulnerabilities/mmio_stale_data:Not affected /sys/devices/system/cpu/vulnerabilities/retbleed:Not affected /sys/devices/system/cpu/vulnerabilities/spec_store_bypass:Vulnerable /sys/devices/system/cpu/vulnerabilities/spectre_v1:Mitigation: __user pointer sanitization /sys/devices/system/cpu/vulnerabilities/spectre_v2:Vulnerable /sys/devices/system/cpu/vulnerabilities/srbds:Not affected /sys/devices/system/cpu/vulnerabilities/tsx_async_abort:Not affected
alciregi Toshiba TECRA A40-D dual core Intel Core i5-7200U [1] 1. Vulnerability status: /sys/devices/system/cpu/vulnerabilities/itlb_multihit:KVM: Mitigation: VMX disabled /sys/devices/system/cpu/vulnerabilities/l1tf:Mitigation: PTE Inversion; VMX: conditional cac he flushes, SMT vulnerable /sys/devices/system/cpu/vulnerabilities/mds:Mitigation: Clear CPU buffers; SMT vulnerable /sys/devices/system/cpu/vulnerabilities/meltdown:Mitigation: PTI /sys/devices/system/cpu/vulnerabilities/mmio_stale_data:Mitigation: Clear CPU buffers; SMT vulnerable /sys/devices/system/cpu/vulnerabilities/retbleed:Mitigation: IBRS /sys/devices/system/cpu/vulnerabilities/spec_store_bypass:Mitigation: Speculative Store Bypass disabled via prctl /sys/devices/system/cpu/vulnerabilities/spectre_v1:Mitigation: usercopy/swapgs barriers and __user pointer sanitization /sys/devices/system/cpu/vulnerabilities/spectre_v2:Mitigation: IBRS, IBPB: conditional, RSB filling, PBRSB-eIBRS: Not affected /sys/devices/system/cpu/vulnerabilities/srbds:Mitigation: Microcode /sys/devices/system/cpu/vulnerabilities/tsx_async_abort:Not affected
anatolicvs https://accounts.fedoraproject.org/user/anatolicvs/
arturw OS: Fedora Linux 37 (Thirty Seven) x86_64; Kernel: 6.0.2-301.fc36.x86_64; CPU: AMD Ryzen 7 3700X (16) @ 3.600GHz; GPU: NVIDIA GeForce GTX 1060 3GB; Me m 32G [1] 1. default: PASS; performance: PASS
arturw OS: Fedora Linux 37 (Thirty Seven) x86_64; Kernel: 6.0.2-301.fc37.x86_64; CPU: AMD Ryzen 7 3700X (16) @ 3.600GHz; GPU: NVIDIA GeForce GTX 1060 3GB; Me m 32G [1] 1. default: PASS; performance: PASS
asianstud69 Fedora 36, Asus ROG Strix 713QR, Ryzen 9 5900HX, Nvidia Geforce RTX 3070 Mobile
asianstud69 Fedora 37 Beta, Inspiron N5110, CPU: Intel i5-2410M (4) @ 2.900GHz
atim CPU: quad core AMD Ryzen 3 3300X; Kernel: 6.0.2-300.fc36.x86_64; NVIDIA driver: 520.56.06 [1] 1. Kernel-tests: OK. For NVIDIA GPU you need 520.56.06 driver which compatible with 6.0 kernel. Old 515-65 driver not compatible.
belegdol Asus Zenbook UM425IA (Ryzen 5 4500U), Fedora 36
billkamp Fedora 6.1
bittin F37 - Virtualbox - 6.0.2.1
bittin Fedora 37 Beta - Virtualbox [1] 1. Kernel boots as its should :)
bittin Virtualbox - F37 [1] 1. Kernel 6.0.3 works too
bklepzig Ryzen 9 3950X CPU, Gigabyte B550 Aorus Pro AC Motherboard, R9 390X GPU [1] 1. Both the regression and performance tests passed
blakeridgway default [1] 1. 1. kernel-6.0.2-300.fc36.x86_64 - Passed all regression tests on both F36/37 except for a exception when a failure appeared on the Fedora 36 VM for cachedrop...running the test suite a few more time s provided PASSES: https://apps.fedoraproject.org/kerneltest/kernel/6.0.2-300.fc36.x86_64 NOTE: I mistyped the fc37 kernel on my Fedora 37 installed so that explains the fc36 kernel test on Fedora 37...oops... 2. kernel-6.0.2-300.fc37 - Passed all regression tests. https://apps.fedoraproject.org/kerneltest/kernel/6.0.2-300.fc37.x86_64
bobslept kerneltest-6.0.2-301.iso: Dell Inc. Inspiron 7520, Intel® Core™ i5-3210M × 4, Kernel: 6.0.2-301.fc36.x86_64 [1] 1. Regression: Pass & Performance: Pass
bobslept kerneltest-6.0.2-301.iso: Lenovo Yoga Slim 7 14ARE05, AMD Ryzen™ 7 4800U with Radeon™ Graphics × 16, Kernel: 6.0.2-301.fc36.x86_64 [1] 1. Regression: Pass & Performance: Pass
bobslept kerneltest-6.0.2-301.iso: QEMU Standard PC _Q35 + ICH9, 2009_, AMD Ryzen™ 7 4800U with Radeon™ Graphics × 16, Gnome Boxes, Kernel: 6.0.2-301.fc36.x86_ 64 [1] 1. Regression: Pass & Performance: Pass
bojan Lenovo ThinkPad T450s, Noname fanless PC with Intel Core i5-8250U, 6.0.3-300.fc36.x86_64 [1] 1. Default and performance test passed.
bretth KVM 6.0.2-300.fc36 [1] 1. Default & performance tests ok
bretth KVM 6.0.2-300.fc37 [1] 1. Default & performance tests ok
bretth KVM 6.0.2-301.fc36 [1] 1. Default & performance tests ok
bretth KVM 6.0.2-301.fc37 [1] 1. Default & performance tests ok
bretth KVM 6.0.3-300.fc36 [1] 1. Default & performance tests ok
bretth KVM 6.0.3-300.fc37 [1] 1. Default & Performance tests ok
bsimms KVM/QEMU (Standard PC (Q35 + ICH9, 2009) pc-q35-7.0), Fedora 36 - Host: AMD Ryzen 5 1600, Fedora 37 [1] 1. Kernel: 6.0.2-300.fc36.x86_64. Default and performance tests passed. ./default/libhugetlbfs and ./default/paxtest were skipped.
cardondev ThinkPad X1 Carbon 3rd Intel(R) Core(TM) HD Graphics 5500 i5-5300U CPU @ 2.30GHz Linux fedora 6.0.2-300.fc36.x86_64 [1] 1. Default and Performance Test PASSED. Boot time its a fraction slower
celidon Fedora 36 Test Day Image [1] 1. Default and Performance passed
celsotavaresdev Fedora 36 Test Day Image [1] [2] 1. runtests.sh -t performance Test suite complete PASS
2. runtests.sh Test suite complete PASS
celsotavaresdev Fedora 36 Test Day Image, Intel Core i5-2500K, 8GB RAM, 6.0.2-300.fc36.x86_64
chguo ThinkBook 14G4+ ARA, AMD Ryzen 7 6800H, kernel: 6.0.2-301.fc36.x86_64
clnetbox Fedora Linux 37 [1] 1. NVIDIA-Linux-x86_64-520.56.06
clnetbox SCHENKER XMG PRO 17 [1] 1. kernel 6.0.2-300.fc37.x86_64
copperi 6.0.2-301.fc36.x86_64 F36 32Gb Ryzen 7 3700x NVIDIA GP106GL [Quadro P2200]
dbrendel Thinkpad T14s Gen1 using kerneltest-6.0.2-301.iso with libvirt-8.6.0-3.fc37.x86_64 + qemu-7.0.0-9.fc37.x86_64 [1] 1. Regression and performance tests passed
dmorris Fedora 36 Host, qemu-6.2.0-15 W-2295 KVM guest, 32 vcpus, 128Gb.
dmorris Windows 11 host: ryzen 3950x Gen2 HyperV. 8 vcpus, 16Gb.
donaldsebleung Kernel 6.0.2-300 on QEMU/KVM [1] 1. Default tests cachedrop failed; performance tests passed
donaldsebleung Kernel 6.0.2-301 on QEMU/KVM
dskobra [1] 1. amd ryzen 9 3900x, 64gb ram, ASUS X570 Crosshair VIII Hero (Wi-Fi) Gigabyte radeon 5700xt reddragon m913 wireless gaming mouse roccat vulvan 120 amio mechanical keyboard logitech blue snowball steelseries arctis 1 wireless gaming headset Startech pcie usb 3.1 card Asus VG278Q 27" HD 1920 x1080 144hz 1ms monitors x3
dupaclet kernel 6.0.3-300.fc36.x86_64 on intel 12700k / msi z690
esoucy Fedora 36 bare metal, Microsoft Surface Go 3, Intel Pentium 6500Y, 4 GB memory [1] 1. Default and performance test suites pass.
esoucy Fedora 37 bare metal, Asus x79 Deluxe motherboard, Intel Xeon E5-1680 v2, 32 GB memory [1] 1. Default and performance tests OK
fedorac kernel 6.0.2-300.fc36.x86_64 on MacBook Pro 2020 13" [1] 1. default, minimal, performance PASSED, stress FAILED (ltp something, still the same)
fedorac1 e7470 DELL NTB Intel(R) Core(TM) i7-6600U CPU @ 2.60GHz kernel 6.0.2-300.fc36.x86_64 [1] 1. default, minimal, performance PASSED, stress FAILED (./stress/ltp, still the same)
g6avk AMD 965, x86_64 Work Station (legacy BIOS) SSD's > RAID1. Plasma DE from Zawertun's COPR. nVidia GT1030 card using nVidia RPM's from RPMFusion (520.56 .06) [1] 1. The enabled Default and Performance tests pass OK, nVidia module built fine no issues.
geraldosimiao F36 KDE on Acer Aspire i7-3632QM CPU Mesa Intel HD Graphics 4000 [1] [2] [3] [4] [5] [6] 1. kernel-6.0.3-300.fc36.x86_64 - PASSED all regression tests
2. kernel-6.0.2-301.fc36.x86_64 - PASSED all regression tests
3. kernel-6.0.2-300.fc36.x86_64 - Passed all regression tests: https://apps.fedoraproject.org/kerneltest/kernel/6.0.2-300.fc36.x86_64
4. kernel-6.0.2-0.rc1.20221013git2640a427a92b.300.fc36.x86_64 - Passed all regression tests - https://apps.fedoraproject.org/kerneltest/kernel/6.0.2-0.rc1.20221013git2640a427a92b.300.fc36.x86_64
5. kernel-6.0.1-0.rc1.20221010git6556cadf037c.300.fc36.x86_64 - [Passed all regression tests](https://apps.fedoraproject.org/kerneltest/kernel/6.0.1-0.rc1.20221010git6556cadf037c.300.fc36.x86_64)
6. kernel-6.0.0-300.fc36.x86_64 - Passed all regression tests
gerritzen FC36, Lenovo ThinkPad X1 Carbon 5th, Intel i7-7600U [1] 1. ./default/libhugetlbfs and ./default/paxtest got skipped
gibson Fedora 36 Workstation, X570 Taichi motherboard, Ryzen 5800X, RX 6800XT, 16 GB RAM [1] 1. The cachedrop test failed with "TestError: Can't free dentries and inodes". Other tests beside cachedrop seem to have passed successfully. I uploaded logs for both default and performance tests to the kernel test site.
groogee OS: Fedora Linux 36 (Workstation Edition) x86_64, Host: KVM/QEMU (Standard PC (Q35 + ICH9, 2009) pc-q35-6.2) , Kernel: 6.0.2-301.fc36.x86_64 [1] 1. Regression and performance tests passed.
hricky ASRock H97 Pro4, Intel® Core™ i7-4790 × 8, 32.0 GiB RAM, Bare Metal
hricky Intel(R) Celeron(R) CPU G3900 @ 2.80GHz, 8.0 GiB RAM, Bare Metal
imabug Fedora 36, Intel Xeon W3690, nVidia GTX 1660Ti, 24GB RAM [1] 1. Default tests passed
imabug Fedora 37, Intel Core i5-3230M, 8GB RAM [1] 1. Default tests passed
imabug kernel 6.0.2-301.fc36.x86_64, Fedora 36, Intel Xeon W3690, nVidia GTX 1660Ti, 24GB RAM [1] 1. Default test passed
imabug kernel 6.0.2-301.fc37.x86_64, Fedora 37, Intel Core i5-3230M, 8GB RAM [1] 1. Default tests passed
itrymybest80 kernel-6.0.2-300.fc36.x86_64
itrymybest80 kernel-6.0.2-301.fc36.x86_64
itrymybest80 kernel-6.0.3-300.fc36.x86_64
jbk0 Fedora 36 Test Day Image, Dell Precision 5510 (https://linux-hardware.org/?probe=d56d0aceaf, ran on main install) [1] 1. Ran both the default and the performance testsuite. Performance one took a while, but both ended without errors in the end.
jdg216 F36 Gnome on Intel NUC8i3BEH, ntel® Core™ i3-8109U × 4, Mesa Intel® Iris® Plus Graphics 655 (CFL GT3)
jelabarre OS: Fedora Linux 37 (Cinnamon) x86_64 Host: Dell Inspiron One 2020 Kernel: 6.0.2-301.fc37.x86_64 CPU: Intel i3-2120 (4) @ 3.300GHz GPU: Intel 2nd Generation Core Processor Family Memory: 936MiB / 7831MiB [1] 1. Running the 'runtests.sh -t performance' option took two hours for just the "Calculating file system latency" step. 'Bandwidth measurements' took over one hour.
jishi Intel(R) Xeon(R) CPU E5-2620 v4 @ 2.10GHz [1] 1. 1. gre basic test 2. vxlan basic test 3. geneve basic test 4. route basic test 5. ipv6 basic test
koralowiec
lily ampere hr330a [1] [2] 1. all default and performance testcases passed
2. all default and performance testcases passed
lily cloud qe [1] 1. all default and performance testcases passed
lily dell per7425 [1] 1. all default and performance testcases passed
lily dell per805 [1] 1. all default and performance testcases passed
lily fujitsu fx700 [1] 1. all default and performance testcases passed
lily hpe apollo [1] [2] 1. all default and performance testcases passed
2. all default and performance testcases passed
lily hpe dl120gen9 [1] 1. all default and performance testcases passed
lily hpe dl320g5 [1] 1. all default and performance testcases passed
lily lenovo rd230 [1] 1. all default and performance testcases passed
lily lenovo st550 [1] 1. all default and performance testcases passed
lily qualcomm amberwing [1] 1. all default and performance testcases passed
lovenemesis AMD A10-5800K Desktop [1] 1. Default and performance all passed.
lovenemesis Acer Spin5 Ryzen 5600U Laptop [1] 1. Default and Performance all passed.
lukenukem 6.0.2-300.fc37.x86_64, ASUS ROG Zephyrus M16 GU603ZW, 12th Gen Intel® Core™ i9-12900H × 20, NVIDIA GeForce RTX™ 3070 Ti Laptop GPU / Mesa Intel® Graph ics [1] 1. CPU is able to boost all cores (simultaneously) very high on 5.19.x kernel (up to 5Ghz). On 6.0.x this appears to behave as if the laptop is runnign on battery with very light boosts and if all cores are utilized the frequency (of each) gets pegged to 2100Mhz or less. TLDR: Individual cores can boost up to 5Ghz, but if all cores are used they get limited to 2100Mhz. Kernel 5.19.x allows all cores at once to boost up to 5Ghz.
luya Dell Inc. Inspiron 14 7425 2-in-1 [1] 1. #2123576, Test passed. However, this version has issue related to resume from a NVMe driver on a Dell laptop fixed upstream. Patch tested on 6.0.0rc which can get backported on kernel 6.0.x series. See https:// bugzilla.kernel.org/show_bug.cgi?id=216440
manan Fedora 36 Live Image on Intel i3-3110M, 4GB RAM, HDD, Integrated Graphics [1] 1. Kernel: 6.0.2-300.fc36.x86_64. Performance test passed. Warning in default test about implicit declaration of functions named 'fcntl', 'open' and 'fallocate'.
markyb73 [1] 1. AMD Ryzen Pro 8 5850U, Fedora 36 running QEMU (Fedora 36 VM) all tests passed.
martyseb F36 Manufacturer: Notebook, Product Name: W54_55_94_95_97AU,AUQ [1] 1. Test suite called with default are failed because ./default/cachedrop is failed. However, Test suite called with performance are passed.
masami i7-9700K(UHD Graphics 630), 6.0.2-301.fc37.x86_64 [1] 1. Regression and performance tests passed. Works fine for daily use.
matthewgosling
max_y CPU: Intel Core i5-3570K MB: ASRock Z77 Pro4-M F36 test day image kerneltest-6.0.2-301.iso [1] 1. default and performance
mdubell Fedora 36 test image running in GNOME Boxes. VM Specs Ryzen 5900, 12 GB Memory
mharpau 6.0.2-300.fc36.x86_64 on TP X1 Carbon 9, Intel Core i7-1165G7, Intel Iris Xe Graphics [1] 1. All standard an performance tests passed
mikeilabs
miko
miko 6.0.2-301.fc37.x86_64, ASUS EX-A320M-GAMING, AMD Ryzen 5 1500X, AMD Radeon RX 6600
miko 6.0.3-300.fc37.x86_64, ASUS EX-A320M-GAMING, AMD Ryzen 5 1500X, AMD Radeon RX 6600 [1] 1. default and performance
mmmarkkk [1] 1. All tests passed including performance test
mn fedora 6.0.2-300.fc36.x86_64
mn fedora 6.0.2-300.fc36.x86_64 running on VirtualBox 6.1 VM: 4vCPU / 4096MB mem HostPC: ASUS ZenBook Intel Core(TM) i7-10510U CPU @ 1.80GHz / 16GB mem [1] 1. 1. Default test failed because timer-overhead test failed 2. Peformance test passed
mwulff 6.0.2-300.fc36.x86_64 on QEMU/KVM, Intel Core i7-1165G7, Intel Iris Xe Graphics [1] 1. All standard an performance tests passed
mzink ThinkPad T14s Gen 1 [1] 1. runtests.sh ... Test suite complete PASS runtests.sh -t performance ... Test suite complete PASS
nixuser Fedora 37 as a VirtualBox 7.0.0 guest [1] 1. kernel-6.0.2-301.fc37.x86_64
nixuser Fedora 37 on Dell Optiplex 3040 1 x Intel(R) Core(TM) i3-6100T CPU @ 3.20GHz Intel Corporation HD Graphics 530 (rev 06) [1] 1. kernel-6.0.2-301.fc37.x86_64
nixuser Fedora 37 on Dell Precision T5610 2 x Intel(R) Xeon(R) CPU E5-2603 v2 @ 1.80GHz (8 cores total) NVIDIA Corporation GK104 [GeForce GTX 760] (rev a1) [1] 1. kernel-6.0.2-301.fc37.x86_64
nixuser Fedora 37 on Intel NUC i7 NUC11PAH 1 x 11th Gen Intel(R) Core(TM) i7-1165G7 @ 2.80GHz Intel Corporation TigerLake-LP GT2 [Iris Xe Graphics] (rev 01) [1] [2] 1. kernel-6.0.3-300.fc37.x86_64
2. kernel-6.0.2-301.fc37.x86_64
norbertj kerneltest-6.0.2.iso on Ideapad V110-15ISK with Core i3-6006U and 8 GiB RAM [1] 1. paxtest and libhugetlbfs SKIP (as ususal), rest of default tests and performance tests PASS. No regressions noted.
norbertj kerneltest-6.0.2.iso on desktop PC with Ryzen 3 3200G, B450 chipset and 16 GiB RAM [1] 1. paxtest and libhugetlbfs SKIP (as ususal), rest of default tests and performance tests PASS. Possible regression: Recordings from my analogue headset are extremly faint, even if the mic volume is set to max in pavucontrol.
norbertj kerneltest-6.0.2.iso on old desktop PC with Core i5-750, P55 chipset, Radeon HD6450 and 4 GiB RAM [1] 1. paxtest and libhugetlbfs SKIP (as ususal), rest of default tests and performance tests PASS. No regressions noted.
norman Fedora 37 on Dell Latitude E5440 [1] 1. 6.0.2-300.fc37.x86_64; all tests PASSED
oscar-2n6g KVM 6.0.2-300.fc36 [1] 1. #0, Passed tests
oumuamua VirtualBox Graphical User Interface Version 6.1.40_rpmfusion r154048 [1] 1. Vulnerability status: /sys/devices/systen/cpu/vulnerabilities/itlb_multihit:KVH: Witigation: VHX unsupported /sys/devices/systen/cpu/vulnerabilities/11tf: Mitigation: PTE Inversion /sys/devices/s ysten/cpu/vulnerabilities/nds: Mitigation: Clear CPU buffers; SMT Host state unknown /sys/devices/systen/cpu/vulnerabilities/meltdown: Mitigation: PTT /sys/devices/systen/cpu/vulnerabilities/mmio_stale_data:Not affected /sys/devices/systen/cpu/vulnerabilities/retbleed:Not affected /sys/devices/systen/cpu/vulnerabilities/spec_store_bypass:Vulnerable /sys/devices/systen/cpu/vulnerabilities/spectre_vl:Mitigation: usercopy/swapgs barriers and __user pointer sanitization /sys/devices/systen/cpu/vulnerabilities/spectre_va:Mitigation: Retpolines, STIBP: disabled, RSB filling, PBRSB-eIBRS: Not affected /sys/devices/systen/cpu/vulnerabilities/srbds:Not affected /sys/devices/systen/cpu/vulnerabilities/tsx_async_abort:Not affected
pany kernel 6.0.2-300.fc37.x86_64 on MacBookPro12,1 Intel(R) Core(TM) i5-5257U [1] 1. 1. Default tests passed
paragnomen Operating System: Fedora Linux 37 KDE Plasma Version: 5.25.5 KDE Frameworks Version: 5.98.0 Qt Version: 5.15.6 Kernel Version: 6.0.2-301.fc37.x86_64 ( 64-bit) Graphics Platform: Wayland Processors: 4 × Intel® Core™ i5-7Y57 CPU @ 1.20GHz Memory: 7.5 GiB of RAM Graphics Processor: Mesa Intel® HD Graphics 615 Manufacturer: LENOVO Product Name: 20JCS11302 System Version: ThinkPad X1 Tablet Gen 2 [1] 1. Both regression and performance tests passed. Test logs successfully uploaded as paragnomen on Paragnomen.
paragnomen Operating System: Fedora Linux 37 KDE Plasma Version: 5.26.2 KDE Frameworks Version: 5.99.0 Qt Version: 5.15.6 Kernel Version: 6.0.7-301.fc37.x86_64 ( 64-bit) Graphics Platform: Wayland Processors: 4 × Intel® Core™ i5-7Y57 CPU @ 1.20GHz Memory: 7.5 GiB of RAM Graphics Processor: Mesa Intel® HD Graphics 615 Manufacturer: LENOVO Product Name: 20JCS11302 System Version: ThinkPad X1 Tablet Gen 2 [1] 1. Kernel Version: 6.0.2-301.fc37.x86_64 (64-bit) tested. Both regression and performance test passed. Cannot find my result, so uploading again. Date: Wed Oct 19 02:34:21 AM CEST 2022 Test set: defaul t Kernel: 6.0.2-301.fc37.x86_64 Release: Fedora release 37 (Thirty Seven) Result: PASS Failed Tests: None Warned Tests: None === Date: Wed Oct 19 02:36:33 AM CEST 2022 Test set: performance Kernel: 6.0.2-301.fc37.x86_64 Release: Fedora release 37 (Thirty Seven) Result: PASS Failed Tests: None Warned Tests: None
paragnomen https://accounts.fedoraproject.org/user/paragnomen/ [1] 1. Operating System: Fedora Linux 37 KDE Plasma Version: 5.25.5 KDE Frameworks Version: 5.98.0 Qt Version: 5.15.6 Kernel Version: 6.0.2-301.fc37.x86_64 (64-bit) Graphics Platform: Wayland Processor s: 4 × Intel® Core™ i5-7Y57 CPU @ 1.20GHz Memory: 7.5 GiB of RAM Graphics Processor: Mesa Intel® HD Graphics 615 Manufacturer: LENOVO Product Name: 20JCS11302 System Version: ThinkPad X1 Tablet Gen 2
pkalorog OS: Fedora Linux 36 x86_64; Kernel: 6.0.2-301.fc36.x86_64; CPU: AMD Ryzen 7 3700X 8-Core; GPU: NVDIA GeForce GT 1030 [1] 1. 1. default test suite = PASS 2. performance test suite = PASS
prgutier [1] 1. Intel(R) Core(TM) i7-9850H CPU @ 2.60GHz CPU(s) scaling MHz: 21% CPU max MHz: 4600.0000 CPU min MHz: 800.0000 H/W path Device Class Description =============================================================== /0/0 memory 32GiB System memory /0/100/14.2 memory RAM memory 00:02.0 VGA compatible controller: Intel Corporation CoffeeLake-H GT2 [UHD Graphics 630] (rev 02)
raev VMWare Workstation 16.2.4 VM with F36 test day image installed, 2GB RAM, 1 CPU Socket with 2 Cores / Host: i7-12700H [1] 1. both regression and performance Tests passed
raev default
rdutan
rdutan Hewlett-Packard Company Compaq 500B Microtower, 2GB, 2CPU [1] 1. Hardware Info
richli kerneltest-6.0.2.iso on AMD Ryzen 7 5800X, ASUS TUF Gaming B550-PLUS, 32 GiB RAM [1] 1. Default and performance tests pass; paxtest and libhugetlbfs skipped
rick [1] 1. Seems to be working OK
rnanclares Fedora 36 on Lenovo Thinkpad X1 Carbon 6th gen - Intel Core i7-8650U - Mesa Intel UHD Graphics 620
rnanclares Fedora 36 on i7-12700K [1] 1. Done!
sashapgt default
seaninspace Lenovo ThinkPad T530 - Intel Core i5-3320M - Fedora 36 - 6.0.2-301.fc36.x86_64
shortgame11 [1] 1. (VM)
skippertux Dell Inc. Precision 7560, Intel® Xeon® W-11955M × 16, 64.0 GiB, NVIDIA Corporation T1200 Laptop GPU, F36 test day image kerneltest-6.0.2-301.iso [1] 1. Basic set of tests ./default/paxtest SKIP ./default/libhugetlbfs SKIP Performance test suites /bi n/sh: line 1: ../scripts/getlist: Permission denied /bin/sh: line 1: ../scripts/getsummary: Permission denied make: *** [Makefile:110: summary] Error 126
snappysir Fedora 36 on a MacBook Air 2012 [1] 1. I got a warning on sysfs-perms. Performance seems more than adequate.
solinvictuz Dell Inc. XPS 13 7390, Intel® Core™ i7-10510U, Mesa Intel® UHD Graphics (CML GT2), 16GiB RAM, UEFI: ver 1.18.0 [1] 1. default and performance passed without problems
stklcode 6.0.2-301.fc36.x86_64, KVM (Host: AMD Ryzen 7 Pro 4750U) [1] 1. Default & performance tests ok
stklode 6.0.2-301.fc36.x86_64, KVM (Host: intel Skylake-X CPU, X299 Chipset, nvidia TU116 GPU) [1] 1. Default & performance tests ok
stylingspectacle Fedora 36 KDE Spin on Dell Inspiron 5567 w/ Secure Boot [1] [2] 1. kernel 6.0.2-300.fc37.x86_64 Passed or skipped all standard and performance regression tests
2. 1. kernel 6.0.2-300.fc37.x86_64 Passed or skipped all standard and performance regression tests
t3rm1n4l ASUS P8Z77 VPro Intel i7 3770 (IvyBridge) DDR3@1600 (XMP) Nvidia Geforce 1060 6 Gb [1] 1. all tests passed
tharadash HP Z440 Workstation, RX570, UEFI
trugul Lenovo Thinkpad L440, memory 12 GB, Intel core i5.4200Mx4, Mesa Intel HD Graphics 4600 (HSW GT2)
tseewald Fedora 37 x86_64, Intel i7-12700k, AMD RX 6700 XT, 32 GB DDR5, Samsung 980 Pro 1TB [1] 1. Default and performance tests pass.
user VM fedora 37 beta
vaparetia [1] 1. #0, Works like a champ. Asus TUF 506QE-MS74 AMD Ryzen 7 5800H with Radeon Graphics and Nvidia 3050ti.
wayne6001 Kernel 6.0.2-301 on a Dell XPS 13 9350 laptop (F36) and a pair of Intel NUC6i5SYK (F36 and F37) [1] [2] [3] 1. 6.0.2-301.fc37.x86_64 Intel NUC6i5SYK - Default and Performance tests PASS (F37)
2. 6.0.2-301.fc36.x86_64 Intel NUC6i5SYK - Default and Performance tests PASS (F36)
3. 6.0.2-301.fc36.x86_64 Dell XPS 13 935 - Default and Performance tests PASS (F36)
wayne6001 Kernel 6.0.3-300 on a Dell XPS 13 9350 laptop (F36) and a pair of Intel NUC6i5SYK (F36 and F37) [1] [2] [3] 1. 6.0.3-300.fc37.x86_64 Intel NUC6i5SYK - Default and Performance tests PASS (F37)
2. 6.0.3-300.fc36.x86_64 Intel NUC6i5SYK - Default and Performance tests PASS (F36)
3. 6.0.3-300.fc36.x86_64 Dell XPS 13 935 - Default and Performance tests PASS (F36)
wayne6001 kernel 6.0.2-300.fc36.x86_64, Intel NUC6i5SYK, Intel Core i5-6260U × 4, Mesa Intel Iris Graphics 540 (SKL GT3), F36 [1] [2] 1. Also, kernel 6.0.2-300.fc36.x86_64 on a Dell Inc. XPS 13 9350, Intel Core i7-6560U × 4, Mesa Intel Iris Graphics 540 (SKL GT3), F36 passed both Default and Performance regression tests. Laptop is wor king fine in normal use since yesterday.
2. Default and Performance regression tests passed. Working fine since yesterday.
wayne6001 kernel 6.0.2-300.fc37.x86_64, Intel NUC6i5SYK, Intel Core i5-6260U × 4, Mesa Intel Iris Graphics 540 (SKL GT3), Fedora Linux 37 (Workstation Edition), Wayland [1] 1. Default and Performance regression tests both passed on Fedora 37. No problems in normal use so far.
whizooor Lenovo Lenovo E31-70 Intel® Core™ i5-5200U × 4 8.0 GB DDR3 Mesa Intel® HD Graphics 5500 (BDW GT2) [1] 1. Regression and performance tests passed, Note: ./default/libhugetlbfs and ./default/paxtest have been skipped.
willyanto Fedora 36 KVM 6.0.2-301.fc36.x86_64 [1] [2] 1. Performance test: PASSED
2. Default test: PASSED
wyrquill 6.0.2-300.fc36.x86_64; Intel® Core™ i5-5200U × 4; Mesa Intel® HD Graphics 5500 (BDW GT2); 6 GB RAM; Fedora Linux 36 (Workstation Edition) [1] 1. Performance: PASS; Regression: WARN (./default/sysfs-perms).
xf01213 kerneltest-6.0.2.iso on Gigabyte Aorus X570 Elite, AMD Ryzen 9 3900XT, Fedora 25 host / Kernel: 5.19.15-201.fc36.x86_64; 32GiB RAM; AMD Lexa PRO [Rade on RX 550]; Guest 8GiB RAM
yourlocalsuperuser kernel 6.0.2-301.fc36.aarch64 on UTM Apple M1 [1] 1. Default & performance tests: ok
Wiki Metadata