Kernel 5.7 Test Week

More information about the event can be found here: http://fedoraproject.org/wiki/Test_Day:2020-06-22_Kernel_5.7_Test_Week
Go back to List of Events.

Results

Clicking on the testcase name will show you the appropriate "how to test" page.
Click on the Enter result button, to enter result.
Note: results are cached and realoaded from the database each 10 seconds.

Regression Test

Username Profile Regression Comments
Enter result
Aarn01d [1] 1. I suggest in the next live iso to add the libtirpc-devel packages so users dont need to install anything extra to run the performance test
Dave H Running in Boxes over Fedora 32 on ASUS ROG GL752VW Hardware [1] 1. [root@localhost-live kernel-tests]# ./runtests.sh No .config file found. You can cp config.example .config and edit as needed for easier log submission. Test suite called with default ./default/cachedrop PASS ./default/paxtest SKIP ./default/posix_timers PASS ./default/libhugetlbfs SKIP ./default/insert_leap_second PASS ./default/modsign PASS ./default/mq-memory-corruption PASS ./default/selinux-dac-controls PASS ./default/sysfs-perms PASS ./default/timer-overhead PASS ./default/stack-randomness PASS ./default/memfd PASS Test suite complete PASS
Marcelo Gallardo [1] 1. Good
alciregi Raspberry Pi 3 aarch64
alciregi Sun Fire X4140 Six-Core AMD Opteron(tm) Processor 2427 [1] 1. Vulnerability status: /sys/devices/system/cpu/vulnerabilities/itlb_multihit:Not affected /sys/devices/system/cpu/vulnerabilities/l1tf:Not affected /sys/devices/system/cpu/vulnerabilities/mds:Not affected /sys/devices/system/cpu/vulnerabilities/meltdown:Not affected /sys/devices/system/cpu/vulnerabilities/spec_store_bypass:Not affected /sys/devices/system/cpu/vulnerabilities/spectre_v1:Mitigation: usercopy/swapgs barriers and __user pointer sanitization /sys/devices/system/cpu/vulnerabilities/spectre_v2:Mitigation: Full AMD retpoline, STIBP: disabled, RSB filling /sys/devices/system/cpu/vulnerabilities/srbds:Not affected /sys/devices/system/cpu/vulnerabilities/tsx_async_abort:Not affected
andymenderunix EliteBook 8570p (Intel core i7-3520M, 8GB RAM, Intel HD 4000 graphics) [1] 1. Loads of worrying compiler warnings in the benchmarking C code. All green otherwise.
archmunky BM,LiveCD: HP 14-CF001fdx, i3-8130U CPU @ 3.40GHz, 16GB DDR4 @ 2400 MT/s [1] 1. Default: PASS (skipped paxtest, libhugetlbfs) - Performance: PASS (warnings for implicit declaration of lmbench_usage, permission denied scripts getlist and getsummary running as root)
archmunky BM/LiveCD: i5-6600K @ 3.5GHz; 32GB DDR4 @ 2133 MT/s [1] 1. Default: PASS (skipped paxtest, libhugetlbfs) - Performance: PASS (warnings for implicit declaration of lmbench_usage, permission denied scripts getlist and getsummary running as root)
asitha-sena Thinkpad X1 Carbon (Intel® Core™ i5-6200U CPU @ 2.30GHz × 4)
atim CPU: Quad Core AMD Athlon X4 845; NVIDIA GP106 [GeForce GTX 1060 6GB] driver: nvidia v: 440.82 [1] 1. All tests passed and everything OK.
augenauf F32 with kernel 5.7.6 from koji in VM [1] 1. Passed both default and performance test. No issues or regressions noted with kernel 5.7.6 from koji
augenauf F32 with kernel 5.7.6 on Thinkpad T440s [1] 1. passed default test(s) on all-Intel Thinkpad T440s using kernel 5.7.6 from koji
azbaer AMD Ryzen 7x8-core processor, 16 GB of Ram [1] 1. All good
bigghe [1] 1. Default test --------------- Test suite called with default ./default/libhugetlbfs SKIP ./default/memfd PASS ./default/modsign PASS ./default/sysfs-perms PASS ./default/stack-randomness PASS ./default/cachedrop FAIL ./default/insert_leap_second PASS ./default/mq-memory-corruption PASS ./default/timer-overhead PASS ./default/selinux-dac-controls PASS ./default/posix_timers PASS ./default/paxtest SKIP Test suite complete FAIL Performance test ----------------------- Can't finish this test suite
blueduckdock42 Kernel test ISO on a Proxmox VM- 2vcpu, 4GB RAM [1] 1. /bin/sh: ../scripts/getlist: Permission denied /bin/sh: ../scripts/getsummary: Permission denied make: *** [Makefile:110: summary] Error 126 Related to getting the list and summary at end of performance test. Otherwise both suites PASS. Same as my other result only updated my profile for it.
blueduckdock42 fedora-coreos-32.20200601.1.1-live.x86_64.iso [1] 1. /bin/sh: ../scripts/getlist: Permission denied /bin/sh: ../scripts/getsummary: Permission denied make: *** [Makefile:110: summary] Error 126 Related to getting the list and summary at end of performance test. Otherwise both suites PASS.
bojan default, performance
bt0dotninja DELL Precision 7510 Core i7 vpro [1] 1. Test suite complete PASS Your log file is being submitted... Upload successful! The following information is not submitted with your log; it is for informational purposes only. Vulnerability status: /sys/devices/system/cpu/vulnerabilities/itlb_multihit:KVM: Mitigation: Split huge pages /sys/devices/system/cpu/vulnerabilities/l1tf:Mitigation: PTE Inversion; VMX: conditional cache flushes, SMT vulnerable /sys/devices/system/cpu/vulnerabilities/mds:Mitigation: Clear CPU buffers; SMT vulnerable /sys/devices/system/cpu/vulnerabilities/meltdown:Mitigation: PTI /sys/devices/system/cpu/vulnerabilities/spec_store_bypass:Mitigation: Speculative Store Bypass disabled via prctl and seccomp /sys/devices/system/cpu/vulnerabilities/spectre_v1:Mitigation: usercopy/swapgs barriers and __user pointer sanitization /sys/devices/system/cpu/vulnerabilities/spectre_v2:Mitigation: Full generic retpoline, IBPB: conditional, IBRS_FW, STIBP: conditional, RSB filling /sys/devices/system/cpu/vulnerabilities/srbds:Vulnerable: No microcode /sys/devices/system/cpu/vulnerabilities/tsx_async_abort:Mitigation: Clear CPU buffers; SMT vulnerable
chivux [1] 1. Vulnerability status: /sys/devices/system/cpu/vulnerabilities/itlb_multihit:Not affected /sys/devices/system/cpu/vulnerabilities/l1tf:Not affected /sys/devices/system/cpu/vulnerabilities/mds:Not affected /sys/devices/system/cpu/vulnerabilities/meltdown:Not affected /sys/devices/system/cpu/vulnerabilities/spec_store_bypass:Mitigation: Speculative Store Bypass disabled via prctl and seccomp /sys/devices/system/cpu/vulnerabilities/spectre_v1:Mitigation: usercopy/swapgs barriers and __user pointer sanitization /sys/devices/system/cpu/vulnerabilities/spectre_v2:Mitigation: Full AMD retpoline, STIBP: disabled, RSB filling /sys/devices/system/cpu/vulnerabilities/srbds:Not affected /sys/devices/system/cpu/vulnerabilities/tsx_async_abort:Not affected
chrisa VirtualBox, 128MB video RAM, 1024MB RAM, 90GB disk [1] 1. Test suite called with default ./default/mq-memory-corruption PASS ./default/libhugetlbfs SKIP ./default/posix_timers PASS ./default/paxtest SKIP ./default/modsign PASS ./default/selinux-dac-controls PASS ./default/stack-randomness PASS ./default/sysfs-perms PASS ./default/cachedrop PASS ./default/insert_leap_second FAIL ./default/memfd PASS ./default/timer-overhead PASS Test suite complete FAIL Test suite called with default ./default/mq-memory-corruption PASS ./default/libhugetlbfs SKIP ./default/posix_timers PASS ./default/paxtest SKIP ./default/modsign PASS ./default/selinux-dac-controls PASS ./default/stack-randomness PASS ./default/sysfs-perms PASS ./default/cachedrop PASS ./default/insert_leap_second FAIL ./default/memfd PASS ./default/timer-overhead PASS Test suite complete FAIL Your log file is being submitted... <!DOCTYPE html PUBLIC "-//W3C//DTD HTML 4.01//EN" "http://www.w3.org/TR/html4/strict.dtd"> <html> <head> <link rel="stylesheet" type="text/css" media="all" href="//fedoraproject.org/static/css/fedora.css"> <link rel="stylesheet" type="text/css" media="print" href="//fedoraproject.org/static/css/print.css"> <link rel="shortcut icon" href="//fedoraproject.org/static/images/favicon.ico" type="image/vnd.microsoft.icon"> <!--[if lt IE 7]> <style type="text/css"> #wrapper { height: 100%; overflow: visible!important; } .download-sidebar a { background-image: none!important; } </style> <![endif]--> <title>Fedora Project</title> </head> <body class="503"> <div id="wrapper"> <div id="head"> <h1><a href="/en/index">Fedora</a></h1> </div> <div id="sidebar"> <div id="nav"> <h2>Navigation</h2> <ul> <li id="nav-home"><a href="//fedoraproject.org/index">Home</a></li> <li id="nav-get"><a href="//fedoraproject.org/get-fedora">Get Fedora</a></li> <li id="nav-join"><a href="//fedoraproject.org/join-fedora">Join Fedora</a></li> <li id="nav-help"><a href="//fedoraproject.org/get-help">Get Help</a></li> </ul> <h2>Tools</h2> <ul> <li><a href="//docs.fedoraproject.org/">Docs</a> Fedora documentation.</li> <li><a href="//fedoraproject.org/wiki/">Wiki</a> Collaborative knowledge.</li> <li><a href="//fedoraplanet.org/">Planet</a> The voices of the Fedora community.</li> <li><a href="//fedoraproject.org/wiki/Communicate">Communicate</a> Speak with Fedora.</li> <li><a href="//fedoraproject.org/wiki/FedoraEvents">Events</a> Meet the Fedora community.</li> </ul> </div> </div> <div id="content"> <h2>Sorry! This service is currently unavailable.</h2> <p>The service that you are trying to access is currently unavailable. Please try refreshing this page in a couple of minutes. If you still see this message, then please follow the steps below:</p> <ol> <li>Check on <a href="http://status.fedoraproject.org/">the status page</a> if there are any known outages for our services.</li> <li>Check the <a href="https://pagure.io/fedora-infrastructure/issues">fedora-infrastructure pagure instance</a> for an outage notification.</li> <li>Ask around in #fedora-admin on irc.freenode.net.</li> <li>If it is accessible, check the <a href="https://docs.pagure.org/infra-docs/sysadmin-guide/sops/outage.html">Outage SOP</a> for more information.</li> </ol> </div> </div> <div id="bottom"> <div id="footer"> <p class="copy"> &copy; 2010 Red Hat, Inc. and others. For comments or queries, please <a href="https://fedoraproject.org/wiki/Communicating_and_getting_help">contact us</a>. </p> <p class="disclaimer"> The Fedora Project is maintained and driven by the community and sponsored by Red Hat. This is a community maintained site. Red Hat is not responsible for content. </p> <ul> <li class="first"><a href="//fedoraproject.org/sponsors">Sponsors</a></li> <li><a href="//fedoraproject.org/wiki/Legal">Legal</a></li> <li><a href="//fedoraproject.org/wiki/Legal/TrademarkGuidelines">Trademark The following information is not submitted with your log; it is for informational purposes only. Checking for kernel signature: The signer's common name is Fedora Secure Boot Signer Vulnerability status: /sys/devices/system/cpu/vulnerabilities/itlb_multihit:Not affected /sys/devices/system/cpu/vulnerabilities/l1tf:Not affected /sys/devices/system/cpu/vulnerabilities/mds:Not affected /sys/devices/system/cpu/vulnerabilities/meltdown:Not affected /sys/devices/system/cpu/vulnerabilities/spec_store_bypass:Mitigation: Speculative Store Bypass disabled via prctl and seccomp /sys/devices/system/cpu/vulnerabilities/spectre_v1:Mitigation: usercopy/swapgs barriers and __user pointer sanitization /sys/devices/system/cpu/vulnerabilities/spectre_v2:Mitigation: Full AMD retpoline, STIBP: disabled, RSB filling /sys/devices/system/cpu/vulnerabilities/srbds:Not affected /sys/devices/system/cpu/vulnerabilities/tsx_async_abort:Not affected
clnetbox CLEVO W370SS | intel i7-4710MQ | 24GB RAM | NVIDIA GTX 860M (drivers version : 440.82) [1] 1. kernel 5.7.5 and 5.7.6 tested - both work as expected (without a single issue)
condor kerneltest-5.7.5.iso
condor kerneltest-5.7.5.iso VM on Intel® Core™ i5-3320M CPU @ 2.60GHz × 4
danchev [1] 1. Test suite called with default ./default/cachedrop PASS ./default/insert_leap_second PASS ./default/libhugetlbfs SKIP ./default/memfd PASS ./default/modsign PASS ./default/mq-memory-corruption PASS ./default/paxtest SKIP ./default/posix_timers PASS ./default/selinux-dac-controls PASS ./default/stack-randomness PASS ./default/sysfs-perms PASS ./default/timer-overhead PASS Test suite complete PASS
davidbryant DELL XPS8930 (Intel i7 9700 cpu, 8 cores) with NVIDIA GEForce 2060 GPU [1] 1. Three tests ("cachedrop", "selinux-dac-controls", and "insert_leap_second") were skipped -- "You need to be root to run this test" in each case. There are some errors in the test script (I ran the tests from the live .iso image): In test "memfd": memfd_test.c: In function ‘mfd_assert_get_seals’: memfd_test.c:67:6: warning: implicit declaration of function ‘fcntl’ [-Wimplicit-function-declaration] memfd_test.c: In function ‘mfd_assert_open’: memfd_test.c:190:6: warning: implicit declaration of function ‘open’; did you mean ‘popen’? [-Wimplicit-function-declaration] memfd_test.c: In function ‘mfd_assert_write’: memfd_test.c:315:6: warning: implicit declaration of function ‘fallocate’; did you mean ‘alloca’? [-Wimplicit-function-declaration] These were just warnings, but I'm reporting them since they stick out like a sore thumb in the log file.
drakkai Lenovo ThinkPad T450 (i5-5300U, 16GB RAM) F32 [1] 1. ulnerability status: /sys/devices/system/cpu/vulnerabilities/itlb_multihit:KVM: Mitigation: Split huge pages /sys/devices/system/cpu/vulnerabilities/l1tf:Mitigation: PTE Inversion; VMX: conditional cache flushes, SMT vulnerable /sys/devices/system/cpu/vulnerabilities/mds:Mitigation: Clear CPU buffers; SMT vulnerable /sys/devices/system/cpu/vulnerabilities/meltdown:Mitigation: PTI /sys/devices/system/cpu/vulnerabilities/spec_store_bypass:Mitigation: Speculative Store Bypass disabled via prctl and seccomp /sys/devices/system/cpu/vulnerabilities/spectre_v1:Mitigation: usercopy/swapgs barriers and __user pointer sanitization /sys/devices/system/cpu/vulnerabilities/spectre_v2:Mitigation: Full generic retpoline, IBPB: conditional, IBRS_FW, STIBP: conditional, RSB filling /sys/devices/system/cpu/vulnerabilities/srbds:Mitigation: Microcode /sys/devices/system/cpu/vulnerabilities/tsx_async_abort:Mitigation: Clear CPU buffers; SMT vulnerable
eismann F32 | Ryzen 3700X | ASUS Strix X570-E [1] 1. Default: PASS (skipped paxtest, libhugetlbfs) - Performance: PASS (warnings for implicit declaration of lmbench_usage)
frantisekz Thinkpad T470s, Intel(R) Core(TM) i7-7600U
gabibbo97 Tongfang G Laptop, i7-9980HK,RTX2060,32G [1] 1. Loads of compiler warnings during performance test suite execution
garrmcnu Test image on VM (KVM) [1] 1. Default and performance tests passed
grdumas kerneltest-5 on Boxes VM, 2GB RAM [1] 1. ./default/libhugetlbfs and ./default/paxtest SKIP, all others PASS
gtb Thinkpad T510
hirat KVM/QEMU on HP Probook 640 [1] 1. /sys/devices/system/cpu/vulnerabilities/itlb_multihit:KVM: Mitigation: Split huge pages /sys/devices/system/cpu/vulnerabilities/l1tf:Mitigation: PTE Inversion; VMX: flush not necessary, SMT disabled /sys/devices/system/cpu/vulnerabilities/mds:Mitigation: Clear CPU buffers; SMT Host state unknown /sys/devices/system/cpu/vulnerabilities/meltdown:Mitigation: PTI /sys/devices/system/cpu/vulnerabilities/spec_store_bypass:Mitigation: Speculative Store Bypass disabled via prctl and seccomp /sys/devices/system/cpu/vulnerabilities/spectre_v1:Mitigation: usercopy/swapgs barriers and __user pointer sanitization /sys/devices/system/cpu/vulnerabilities/spectre_v2:Mitigation: Full generic retpoline, IBPB: conditional, IBRS_FW, STIBP: disabled, RSB filling /sys/devices/system/cpu/vulnerabilities/srbds:Unknown: Dependent on hypervisor status /sys/devices/system/cpu/vulnerabilities/tsx_async_abort:Not affected
ibims Fedora32 Workstation, (non UEFI), AMD Ryzen5 3600, Mainboard MSI B450M Mortar Max with prop. nvidia driver from rpmfusion.org (GTX980 card), 32GB RAM, Samsung SSD 850 PRO 256GB, WD Blue S-ATA HDD 4TB [1] 1. tested Kernel 5.7.6 from koji. (paxtest and libhugetlbfs skipped). No regressions noted.
ibims Fedora32 Workstation, (non UEFI), AMD Ryzen5 3600, Mainboard MSI B450M Mortar Max with prop. nvidia driver from rpmfusion.org (GTX980 card), 32GB RAM, Samsung SSD 850 PRO 256GB, WD Blue S-ATA HDD 4TB [1] 1. Test PASSED
instant28
itrymybest80 Fedora 32 Workstation (x86_64), PRIME Z270-A, i5-7600K, 16GB DDR4, RX 580 8GB (MESA 20.1.1) & 970 EVO M.2 [1] 1. RADV/ACO no longer works in any of my games (wine 5.10, proton 5.0-9 or lutris 5.6) with the latest free & non-free repository updates or MESA driver. However the 5.7.4-200.fc32.x86_64 kernel test image (.iso) installed just fine in my native language (swedish) to my hard drive from usb, LUKS encryption, audio & video playback, network/VPN and all of my peripherals work. Additional information: Vulkan 1.2.131, DRM 3.37.0, LLVM 10.0.0. Default & performance regression tests PASS, "libhugetlbfs" & "paxtest" was skipped. Kdenlive 20.04.2 crashes on launch with QObject::setProperty(char const*, QVariant const&). Firefox 77.0.1 crashes at random on Wayland with SIGSEGV.
ivanmironov PC with AMD Ryzen 9 3950X [1] 1. #1851855, /sys/devices/system/cpu/vulnerabilities/itlb_multihit:Not affected /sys/devices/system/cpu/vulnerabilities/l1tf:Not affected /sys/devices/system/cpu/vulnerabilities/mds:Not affected /sys/devices/system/cpu/vulnerabilities/meltdown:Not affected /sys/devices/system/cpu/vulnerabilities/spec_store_bypass:Mitigation: Speculative Store Bypass disabled via prctl and seccomp /sys/devices/system/cpu/vulnerabilities/spectre_v1:Mitigation: usercopy/swapgs barriers and __user pointer sanitization /sys/devices/system/cpu/vulnerabilities/spectre_v2:Mitigation: Full AMD retpoline, IBPB: conditional, STIBP: conditional, RSB filling /sys/devices/system/cpu/vulnerabilities/srbds:Not affected /sys/devices/system/cpu/vulnerabilities/tsx_async_abort:Not affected Bug not related to test cases: https://bugzilla.redhat.com/show_bug.cgi?id=1851855
jarld AMD Ryzen 3600X / RX580 [1] 1. No issues.
jarld default [1] 1. cachedrop FAIL when selinuxuser_execheap ON (as instructed for tests), PASS when selinuxuser_execheap OFF. Intel® Core™ m3-6Y30 CPU
jatinbatra98 Asus Vivobook 15-X510UF: [1] 1. 1. First
jatinbatra98 Asus Vivobook 15-X510UF: Intel Core i5 8250U. 4 GB DDR4 2400MHz SDRAM Onboard memory. 16 GB Intel Optane memory. NVIDIA GeForce MX130 , with 2GB GDDR5 VRAM. Integrated Intel UHD Graphics 620. 1TB 5400 rpm SATA HDD [1] 1. 1. First Test: Two ./default/libhugetlbfs and ./default/paxtest were SKIPPED 2. Second Test: ../scripts/getlist and ../scripts/getsummary had permission denied issue, otherwise the test PASSED.
joecastrop Asus FX504GE [1] 1. All test passed without errors. Test suite called with default Test suite complete PASS
jpbn [1] 1. $ sudo ./runtests.sh -t performance gives warnings: do not know if it is a bug? st suite called with performance lib_timing.c: In function ‘touch’: lib_timing.c:1626:9: warning: type defaults to ‘int’ in declaration of ‘psize’ [-Wimplicit-int] 1626 | static psize; | ^~~~~ lib_sched.c: In function ‘handle_scheduler’: lib_sched.c:94:3: warning: ‘return’ with no value, in function returning non-void 94 | return; | ^~~~~~ lib_sched.c:46:1: note: declared here 46 | handle_scheduler(int childno, int benchproc, int nbenchprocs) | ^~~~~~~~~~~~~~~~ lib_sched.c: In function ‘sched_pin’: lib_sched.c:207:12: warning: implicit declaration of function ‘sched_getaffinity’ [-Wimplicit-function-declaration] 207 | retval = sched_getaffinity(0, sz * sizeof(unsigned long), cpumask); | ^~~~~~~~~~~~~~~~~ lib_sched.c:231:11: warning: implicit declaration of function ‘sched_setaffinity’ [-Wimplicit-function-declaration] 231 | retval = sched_setaffinity(0, sz * sizeof(unsigned long), mask); | ^~~~~~~~~~~~~~~~~ bw_file_rd.c: In function ‘main’: bw_file_rd.c:149:23: warning: implicit declaration of function ‘lmbench_usage’ [-Wimplicit-function-declaration] 149 | if (parallel <= 0) lmbench_usage(ac, av, usage); | ^~~~~~~~~~~~~ bw_mem.c: In function ‘main’: bw_mem.c:76:23: warning: implicit declaration of function ‘lmbench_usage’ [-Wimplicit-function-declaration] 76 | if (parallel <= 0) lmbench_usage(ac, av, usage); | ^~~~~~~~~~~~~ bw_mmap_rd.c: In function ‘main’: bw_mmap_rd.c:64:23: warning: implicit declaration of function ‘lmbench_usage’ [-Wimplicit-function-declaration] 64 | if (parallel <= 0) lmbench_usage(ac, av, usage); | ^~~~~~~~~~~~~ bw_pipe.c: In function ‘main’: bw_pipe.c:157:23: warning: implicit declaration of function ‘lmbench_usage’ [-Wimplicit-function-declaration] 157 | if (parallel <= 0) lmbench_usage(ac, av, usage); | ^~~~~~~~~~~~~ bw_tcp.c: In function ‘main’: bw_tcp.c:74:23: warning: implicit declaration of function ‘lmbench_usage’ [-Wimplicit-function-declaration] 74 | if (parallel <= 0) lmbench_usage(ac, av, usage); | ^~~~~~~~~~~~~ bw_unix.c: In function ‘main’: bw_unix.c:153:23: warning: implicit declaration of function ‘lmbench_usage’ [-Wimplicit-function-declaration] 153 | if (parallel <= 0) lmbench_usage(argc, argv, usage); | ^~~~~~~~~~~~~ lat_select.c: In function ‘main’: lat_select.c:53:23: warning: implicit declaration of function ‘lmbench_usage’ [-Wimplicit-function-declaration] 53 | if (parallel <= 0) lmbench_usage(ac, av, usage); | ^~~~~~~~~~~~~ lat_select.c: In function ‘doit’: lat_select.c:167:9: warning: type defaults to ‘int’ in declaration of ‘count’ [-Wimplicit-int] 167 | static count = 0; | ^~~~~ lat_pipe.c: In function ‘main’: lat_pipe.c:41:23: warning: implicit declaration of function ‘lmbench_usage’ [-Wimplicit-function-declaration] 41 | if (parallel <= 0) lmbench_usage(ac, av, usage); | ^~~~~~~~~~~~~ lat_rpc.c: In function ‘main’: lat_rpc.c:136:5: warning: implicit declaration of function ‘lmbench_usage’ [-Wimplicit-function-declaration] 136 | lmbench_usage(ac, av, usage); | ^~~~~~~~~~~~~ lat_syscall.c: In function ‘main’: lat_syscall.c:116:23: warning: implicit declaration of function ‘lmbench_usage’ [-Wimplicit-function-declaration] 116 | if (parallel <= 0) lmbench_usage(ac, av, usage); | ^~~~~~~~~~~~~ lat_tcp.c: In function ‘main’: lat_tcp.c:64:5: warning: implicit declaration of function ‘lmbench_usage’ [-Wimplicit-function-declaration] 64 | lmbench_usage(ac, av, usage); | ^~~~~~~~~~~~~ lat_udp.c: In function ‘main’: lat_udp.c:78:5: warning: implicit declaration of function ‘lmbench_usage’ [-Wimplicit-function-declaration] 78 | lmbench_usage(ac, av, usage); | ^~~~~~~~~~~~~ lat_mmap.c: In function ‘main’: lat_mmap.c:58:5: warning: implicit declaration of function ‘lmbench_usage’ [-Wimplicit-function-declaration] 58 | lmbench_usage(ac, av, usage); | ^~~~~~~~~~~~~ mhz.c: In function ‘main’: mhz.c:492:4: warning: implicit declaration of function ‘lmbench_usage’ [-Wimplicit-function-declaration] 492 | lmbench_usage(ac, av, usage); | ^~~~~~~~~~~~~ lat_proc.c: In function ‘main’: lat_proc.c:60:23: warning: implicit declaration of function ‘lmbench_usage’ [-Wimplicit-function-declaration] 60 | if (parallel <= 0) lmbench_usage(ac, av, usage); | ^~~~~~~~~~~~~ lat_pagefault.c: In function ‘main’: lat_pagefault.c:54:23: warning: implicit declaration of function ‘lmbench_usage’ [-Wimplicit-function-declaration] 54 | if (parallel <= 0) lmbench_usage(ac, av, usage); | ^~~~~~~~~~~~~ lat_connect.c: In function ‘main’: lat_connect.c:63:4: warning: implicit declaration of function ‘lmbench_usage’ [-Wimplicit-function-declaration] 63 | lmbench_usage(ac, av, usage); | ^~~~~~~~~~~~~ lat_fs.c: In function ‘main’: lat_fs.c:55:23: warning: implicit declaration of function ‘lmbench_usage’ [-Wimplicit-function-declaration] 55 | if (parallel <= 0) lmbench_usage(ac, av, usage); | ^~~~~~~~~~~~~ /usr/bin/ld: /tmp/ccrMUWA6.o: in function `setup_names': lat_fs.c:(.text+0x831): warning: the use of `tempnam' is dangerous, better use `mkstemp' lat_sig.c: In function ‘main’: lat_sig.c:182:23: warning: implicit declaration of function ‘lmbench_usage’ [-Wimplicit-function-declaration] 182 | if (parallel <= 0) lmbench_usage(ac, av, usage); | ^~~~~~~~~~~~~ lat_mem_rd.c: In function ‘main’: lat_mem_rd.c:47:23: warning: implicit declaration of function ‘lmbench_usage’ [-Wimplicit-function-declaration] 47 | if (parallel <= 0) lmbench_usage(ac, av, usage); | ^~~~~~~~~~~~~ lat_ctx.c: In function ‘main’: lat_ctx.c:74:23: warning: implicit declaration of function ‘lmbench_usage’ [-Wimplicit-function-declaration] 74 | if (parallel <= 0) lmbench_usage(ac, av, usage); | ^~~~~~~~~~~~~ lat_sem.c: In function ‘main’: lat_sem.c:42:23: warning: implicit declaration of function ‘lmbench_usage’ [-Wimplicit-function-declaration] 42 | if (parallel <= 0) lmbench_usage(ac, av, usage); | ^~~~~~~~~~~~~ lat_unix.c: In function ‘main’: lat_unix.c:46:23: warning: implicit declaration of function ‘lmbench_usage’ [-Wimplicit-function-declaration] 46 | if (parallel <= 0) lmbench_usage(ac, av, usage); | ^~~~~~~~~~~~~ lat_fifo.c: In function ‘main’: lat_fifo.c:45:23: warning: implicit declaration of function ‘lmbench_usage’ [-Wimplicit-function-declaration] 45 | if (parallel <= 0) lmbench_usage(ac, av, usage); | ^~~~~~~~~~~~~ lat_http.c: In function ‘main’: lat_http.c:84:4: warning: implicit declaration of function ‘lmbench_usage’ [-Wimplicit-function-declaration] 84 | lmbench_usage(ac, av, usage); | ^~~~~~~~~~~~~ lat_fcntl.c: In function ‘main’: lat_fcntl.c:203:23: warning: implicit declaration of function ‘lmbench_usage’ [-Wimplicit-function-declaration] 203 | if (parallel <= 0) lmbench_usage(ac, av, usage); | ^~~~~~~~~~~~~ lat_unix_connect.c: In function ‘main’: lat_unix_connect.c:63:23: warning: implicit declaration of function ‘lmbench_usage’ [-Wimplicit-function-declaration] 63 | if (parallel <= 0) lmbench_usage(ac, av, usage); | ^~~~~~~~~~~~~ lat_ops.c: In function ‘main’: lat_ops.c:393:23: warning: implicit declaration of function ‘lmbench_usage’ [-Wimplicit-function-declaration] 393 | if (parallel <= 0) lmbench_usage(ac, av, usage); | ^~~~~~~~~~~~~ line.c: In function ‘main’: line.c:54:4: warning: implicit declaration of function ‘lmbench_usage’ [-Wimplicit-function-declaration] 54 | lmbench_usage(ac, av, usage); | ^~~~~~~~~~~~~ tlb.c: In function ‘main’: tlb.c:69:4: warning: implicit declaration of function ‘lmbench_usage’ [-Wimplicit-function-declaration] 69 | lmbench_usage(ac, av, usage); | ^~~~~~~~~~~~~ par_mem.c: In function ‘main’: par_mem.c:64:4: warning: implicit declaration of function ‘lmbench_usage’ [-Wimplicit-function-declaration] 64 | lmbench_usage(ac, av, usage); | ^~~~~~~~~~~~~ par_ops.c: In function ‘main’: par_ops.c:413:4: warning: implicit declaration of function ‘lmbench_usage’ [-Wimplicit-function-declaration] 413 | lmbench_usage(ac, av, usage); | ^~~~~~~~~~~~~ stream.c: In function ‘main’: stream.c:70:5: warning: implicit declaration of function ‘lmbench_usage’ [-Wimplicit-function-declaration] 70 | lmbench_usage(ac, av, usage); | ^~~~~~~~~~~~~ cache.c: In function ‘main’: cache.c:123:4: warning: implicit declaration of function ‘lmbench_usage’ [-Wimplicit-function-declaration] 123 | lmbench_usage(ac, av, usage); | ^~~~~~~~~~~~~ lat_dram_page.c: In function ‘main’: lat_dram_page.c:66:4: warning: implicit declaration of function ‘lmbench_usage’ [-Wimplicit-function-declaration] 66 | lmbench_usage(ac, av, usage); | ^~~~~~~~~~~~~ lat_pmake.c: In function ‘main’: lat_pmake.c:47:23: warning: implicit declaration of function ‘lmbench_usage’ [-Wimplicit-function-declaration] 47 | if (parallel <= 0) lmbench_usage(ac, av, usage); | ^~~~~~~~~~~~~ lat_rand.c: In function ‘main’: lat_rand.c:39:23: warning: implicit declaration of function ‘lmbench_usage’ [-Wimplicit-function-declaration] 39 | if (parallel <= 0) lmbench_usage(ac, av, usage); | ^~~~~~~~~~~~~ lat_usleep.c: In function ‘main’: lat_usleep.c:204:3: warning: implicit declaration of function ‘lmbench_usage’ [-Wimplicit-function-declaration] 204 | lmbench_usage(ac, av, usage); | ^~~~~~~~~~~~~ lat_cmd.c: In function ‘main’: lat_cmd.c:40:23: warning: implicit declaration of function ‘lmbench_usage’ [-Wimplicit-function-declaration] 40 | if (parallel <= 0) lmbench_usage(ac, av, usage); | ^~~~~~~~~~~~~ 2747MB OK
jskladan Intel(R) Core(TM) i7-8650U CPU
kiko964 [1] 1. Asus-X554L CPU: Intel Core i-3 5010U GPU: Intel hd-5500
kostera [1] 1. Works like a charm on Intel(R) Core(TM) i3-8130U CPU @ 2.20GHz Dell Inspiron 5570 (Inspiron 15 5000 Series) with a spinning HDD 5400RPM and 12GB ram
kwurzel Thinkpad S1 Yoga (Intel i7-4500U (Haswell)) [1] 1. 5508MB OK 5508MB OK 5508MB OK mhz: should take approximately 30 seconds Using config in CONFIG.yoga Sun 21 Jun 2020 11:41:01 AM CEST Latency measurements Sun 21 Jun 2020 11:42:31 AM CEST Calculating file system latency Sun 21 Jun 2020 11:43:00 AM CEST Local networking Sun 21 Jun 2020 11:46:49 AM CEST Bandwidth measurements Sun 21 Jun 2020 11:56:40 AM CEST Calculating context switch overhead Sun 21 Jun 2020 11:57:53 AM CEST ./performance/lmbench3 PASS Test suite complete PASS
lbrabec F32, Lenovo T480s (i7-8650U), default, first run [1] 1. ./default/posix_timers PASS ./default/memfd PASS ./default/cachedrop FAIL ./default/paxtest SKIP ./default/insert_leap_second PASS ./default/selinux-dac-controls SKIP ./default/mq-memory-corruption PASS ./default/modsign PASS ./default/timer-overhead PASS ./default/stack-randomness PASS ./default/libhugetlbfs SKIP ./default/sysfs-perms PASS Test suite complete FAIL
lbrabec F32, Lenovo T480s (i7-8650U), default, second run [1] 1. /default/posix_timers PASS ./default/memfd PASS ./default/cachedrop PASS ./default/paxtest SKIP ./default/insert_leap_second PASS ./default/selinux-dac-controls SKIP ./default/mq-memory-corruption PASS ./default/modsign PASS ./default/timer-overhead PASS ./default/stack-randomness PASS ./default/libhugetlbfs SKIP ./default/sysfs-perms PASS Test suite complete PASS
lbrabec F32, Lenovo T480s (i7-8650U), performance [1] 1. ./performance/lmbench3 PASS Test suite complete PASS
lcts F32 Server install on Xeon E3-1270 v2, Asus MB, 16G RAM, btrfs RAID on HDD
lcts testimage on libvirt VM, 2 core, 2GB RAM
lmouillart Dell Inspiron 5579 - i7-8550u / I620 IGP [1] 1. Test suite complete: PASS
lnie Dell PowerEdge R430 [1] 1. all test passed
lnie Qualcomm 65-LA-115-151(aarch64) [1] 1. all test passed
lnie Thinkpad p1 [1] 1. all tests passed
m0stly Workstation 32, Ryzen 3600 / Vega 56 [1] 1. Default and performance tests passed (paxtest and libhugetlbfs skipped). No regressions noted.
madnessy asus fx506iu ( amd 4800h / gtx 1660ti / 32gb ) [1] 1. first impression : graphics are more stable than on 5.6.x kernels
marc84 USB kerneltest-5.6.3.iso on Lenovo ideapad Y570 [1] 1. Running Both Basic and Performance test: The signer's common name is Fedora Secure Boot Signer Vulnerability status: /sys/devices/system/cpu/vulnerabilities/itlb_multihit:KVM: Mitigation: Split huge pages /sys/devices/system/cpu/vulnerabilities/l1tf:Mitigation: PTE Inversion; VMX: conditional cache flushes, SMT vulnerable /sys/devices/system/cpu/vulnerabilities/mds:Mitigation: Clear CPU buffers; SMT vulnerable /sys/devices/system/cpu/vulnerabilities/meltdown:Mitigation: PTI /sys/devices/system/cpu/vulnerabilities/spec_store_bypass:Mitigation: Speculative Store Bypass disabled via prctl and seccomp /sys/devices/system/cpu/vulnerabilities/spectre_v1:Mitigation: usercopy/swapgs barriers and __user pointer sanitization /sys/devices/system/cpu/vulnerabilities/spectre_v2:Mitigation: Full generic retpoline, IBPB: conditional, IBRS_FW, STIBP: conditional, RSB filling /sys/devices/system/cpu/vulnerabilities/srbds:Not affected /sys/devices/system/cpu/vulnerabilities/tsx_async_abort:Not affected
markdram AMD A9-9600, RX560 GPU [1] 1. No issues, suspend/resume works
markdram Dell Inspiron 11 3185 [1] 1. No issues, suspend/resume working
masami fedora 32 workstation. i7-9700K(UHD Graphics 630) [1] 1. Test PASS. works fine on daily use.
masch Kernel test ISO on VirtualBox VM a Intel core i7 CPU Q 740 @ 1.73GHz x 8, Seagate SATA 2.5 PCB, 7,7 GiB RAM on HOST and 2,3 GiB on guest [1] 1. [masch@localhost kernel-tests]$ sudo ./runtests.sh Test suite called with default ./default/paxtest SKIP ./default/libhugetlbfs SKIP ./default/memfd PASS ./default/posix_timers PASS ./default/selinux-dac-controls PASS ./default/timer-overhead PASS ./default/sysfs-perms PASS ./default/cachedrop PASS ./default/modsign PASS ./default/insert_leap_second FAIL ./default/stack-randomness PASS ./default/mq-memory-corruption PASS Test suite complete FAIL Your log file is being submitted... Upload successful! The following information is not submitted with your log; it is for informational purposes only. Checking for kernel signature: The signer's common name is Fedora Secure Boot Signer Vulnerability status: /sys/devices/system/cpu/vulnerabilities/itlb_multihit:KVM: Vulnerable /sys/devices/system/cpu/vulnerabilities/l1tf:Mitigation: PTE Inversion /sys/devices/system/cpu/vulnerabilities/mds:Vulnerable: Clear CPU buffers attempted, no microcode; SMT Host state unknown /sys/devices/system/cpu/vulnerabilities/meltdown:Mitigation: PTI /sys/devices/system/cpu/vulnerabilities/spec_store_bypass:Vulnerable /sys/devices/system/cpu/vulnerabilities/spectre_v1:Mitigation: usercopy/swapgs barriers and __user pointer sanitization /sys/devices/system/cpu/vulnerabilities/spectre_v2:Mitigation: Full generic retpoline, STIBP: disabled, RSB filling /sys/devices/system/cpu/vulnerabilities/srbds:Not affected /sys/devices/system/cpu/vulnerabilities/tsx_async_abort:Not affected ############################################################################################################################## [masch@localhost kernel-tests]$ sudo ./runtests.sh -t performance [sudo] password for masch: [sudo] password for masch: Sorry, try again. [sudo] password for masch: Test suite called with performance lib_timing.c: En la función ‘touch’: lib_timing.c:1626:9: aviso: el tipo de dato por defecto es ‘int’ en la declaración de ‘psize’ [-Wimplicit-int] 1626 | static psize; | ^~~~~ lib_sched.c: En la función ‘handle_scheduler’: lib_sched.c:94:3: aviso: ‘return’ sin valores, en una función que no devuelve void 94 | return; | ^~~~~~ lib_sched.c:46:1: nota: se declara aquí 46 | handle_scheduler(int childno, int benchproc, int nbenchprocs) | ^~~~~~~~~~~~~~~~ lib_sched.c: En la función ‘sched_pin’: lib_sched.c:207:12: aviso: declaración implícita de la función ‘sched_getaffinity’ [-Wimplicit-function-declaration] 207 | retval = sched_getaffinity(0, sz * sizeof(unsigned long), cpumask); | ^~~~~~~~~~~~~~~~~ lib_sched.c:231:11: aviso: declaración implícita de la función ‘sched_setaffinity’ [-Wimplicit-function-declaration] 231 | retval = sched_setaffinity(0, sz * sizeof(unsigned long), mask); | ^~~~~~~~~~~~~~~~~ bw_file_rd.c: En la función ‘main’: bw_file_rd.c:149:23: aviso: declaración implícita de la función ‘lmbench_usage’ [-Wimplicit-function-declaration] 149 | if (parallel <= 0) lmbench_usage(ac, av, usage); | ^~~~~~~~~~~~~ bw_mem.c: En la función ‘main’: bw_mem.c:76:23: aviso: declaración implícita de la función ‘lmbench_usage’ [-Wimplicit-function-declaration] 76 | if (parallel <= 0) lmbench_usage(ac, av, usage); | ^~~~~~~~~~~~~ bw_mmap_rd.c: En la función ‘main’: bw_mmap_rd.c:64:23: aviso: declaración implícita de la función ‘lmbench_usage’ [-Wimplicit-function-declaration] 64 | if (parallel <= 0) lmbench_usage(ac, av, usage); | ^~~~~~~~~~~~~ bw_pipe.c: En la función ‘main’: bw_pipe.c:157:23: aviso: declaración implícita de la función ‘lmbench_usage’ [-Wimplicit-function-declaration] 157 | if (parallel <= 0) lmbench_usage(ac, av, usage); | ^~~~~~~~~~~~~ bw_tcp.c: En la función ‘main’: bw_tcp.c:74:23: aviso: declaración implícita de la función ‘lmbench_usage’ [-Wimplicit-function-declaration] 74 | if (parallel <= 0) lmbench_usage(ac, av, usage); | ^~~~~~~~~~~~~ bw_unix.c: En la función ‘main’: bw_unix.c:153:23: aviso: declaración implícita de la función ‘lmbench_usage’ [-Wimplicit-function-declaration] 153 | if (parallel <= 0) lmbench_usage(argc, argv, usage); | ^~~~~~~~~~~~~ lat_select.c: En la función ‘main’: lat_select.c:53:23: aviso: declaración implícita de la función ‘lmbench_usage’ [-Wimplicit-function-declaration] 53 | if (parallel <= 0) lmbench_usage(ac, av, usage); | ^~~~~~~~~~~~~ lat_select.c: En la función ‘doit’: lat_select.c:167:9: aviso: el tipo de dato por defecto es ‘int’ en la declaración de ‘count’ [-Wimplicit-int] 167 | static count = 0; | ^~~~~ lat_pipe.c: En la función ‘main’: lat_pipe.c:41:23: aviso: declaración implícita de la función ‘lmbench_usage’ [-Wimplicit-function-declaration] 41 | if (parallel <= 0) lmbench_usage(ac, av, usage); | ^~~~~~~~~~~~~ lat_rpc.c: En la función ‘main’: lat_rpc.c:136:5: aviso: declaración implícita de la función ‘lmbench_usage’ [-Wimplicit-function-declaration] 136 | lmbench_usage(ac, av, usage); | ^~~~~~~~~~~~~ lat_syscall.c: En la función ‘main’: lat_syscall.c:116:23: aviso: declaración implícita de la función ‘lmbench_usage’ [-Wimplicit-function-declaration] 116 | if (parallel <= 0) lmbench_usage(ac, av, usage); | ^~~~~~~~~~~~~ lat_tcp.c: En la función ‘main’: lat_tcp.c:64:5: aviso: declaración implícita de la función ‘lmbench_usage’ [-Wimplicit-function-declaration] 64 | lmbench_usage(ac, av, usage); | ^~~~~~~~~~~~~ lat_udp.c: En la función ‘main’: lat_udp.c:78:5: aviso: declaración implícita de la función ‘lmbench_usage’ [-Wimplicit-function-declaration] 78 | lmbench_usage(ac, av, usage); | ^~~~~~~~~~~~~ lat_mmap.c: En la función ‘main’: lat_mmap.c:58:5: aviso: declaración implícita de la función ‘lmbench_usage’ [-Wimplicit-function-declaration] 58 | lmbench_usage(ac, av, usage); | ^~~~~~~~~~~~~ mhz.c: En la función ‘main’: mhz.c:492:4: aviso: declaración implícita de la función ‘lmbench_usage’ [-Wimplicit-function-declaration] 492 | lmbench_usage(ac, av, usage); | ^~~~~~~~~~~~~ lat_proc.c: En la función ‘main’: lat_proc.c:60:23: aviso: declaración implícita de la función ‘lmbench_usage’ [-Wimplicit-function-declaration] 60 | if (parallel <= 0) lmbench_usage(ac, av, usage); | ^~~~~~~~~~~~~ lat_pagefault.c: En la función ‘main’: lat_pagefault.c:54:23: aviso: declaración implícita de la función ‘lmbench_usage’ [-Wimplicit-function-declaration] 54 | if (parallel <= 0) lmbench_usage(ac, av, usage); | ^~~~~~~~~~~~~ lat_connect.c: En la función ‘main’: lat_connect.c:63:4: aviso: declaración implícita de la función ‘lmbench_usage’ [-Wimplicit-function-declaration] 63 | lmbench_usage(ac, av, usage); | ^~~~~~~~~~~~~ lat_fs.c: En la función ‘main’: lat_fs.c:55:23: aviso: declaración implícita de la función ‘lmbench_usage’ [-Wimplicit-function-declaration] 55 | if (parallel <= 0) lmbench_usage(ac, av, usage); | ^~~~~~~~~~~~~ /usr/bin/ld: /tmp/ccW2M6m3.o: en la función `setup_names': lat_fs.c:(.text+0x831): aviso: the use of `tempnam' is dangerous, better use `mkstemp' lat_sig.c: En la función ‘main’: lat_sig.c:182:23: aviso: declaración implícita de la función ‘lmbench_usage’ [-Wimplicit-function-declaration] 182 | if (parallel <= 0) lmbench_usage(ac, av, usage); | ^~~~~~~~~~~~~ lat_mem_rd.c: En la función ‘main’: lat_mem_rd.c:47:23: aviso: declaración implícita de la función ‘lmbench_usage’ [-Wimplicit-function-declaration] 47 | if (parallel <= 0) lmbench_usage(ac, av, usage); | ^~~~~~~~~~~~~ lat_ctx.c: En la función ‘main’: lat_ctx.c:74:23: aviso: declaración implícita de la función ‘lmbench_usage’ [-Wimplicit-function-declaration] 74 | if (parallel <= 0) lmbench_usage(ac, av, usage); | ^~~~~~~~~~~~~ lat_sem.c: En la función ‘main’: lat_sem.c:42:23: aviso: declaración implícita de la función ‘lmbench_usage’ [-Wimplicit-function-declaration] 42 | if (parallel <= 0) lmbench_usage(ac, av, usage); | ^~~~~~~~~~~~~ lat_unix.c: En la función ‘main’: lat_unix.c:46:23: aviso: declaración implícita de la función ‘lmbench_usage’ [-Wimplicit-function-declaration] 46 | if (parallel <= 0) lmbench_usage(ac, av, usage); | ^~~~~~~~~~~~~ lat_fifo.c: En la función ‘main’: lat_fifo.c:45:23: aviso: declaración implícita de la función ‘lmbench_usage’ [-Wimplicit-function-declaration] 45 | if (parallel <= 0) lmbench_usage(ac, av, usage); | ^~~~~~~~~~~~~ lat_http.c: En la función ‘main’: lat_http.c:84:4: aviso: declaración implícita de la función ‘lmbench_usage’ [-Wimplicit-function-declaration] 84 | lmbench_usage(ac, av, usage); | ^~~~~~~~~~~~~ lat_fcntl.c: En la función ‘main’: lat_fcntl.c:203:23: aviso: declaración implícita de la función ‘lmbench_usage’ [-Wimplicit-function-declaration] 203 | if (parallel <= 0) lmbench_usage(ac, av, usage); | ^~~~~~~~~~~~~ lat_unix_connect.c: En la función ‘main’: lat_unix_connect.c:63:23: aviso: declaración implícita de la función ‘lmbench_usage’ [-Wimplicit-function-declaration] 63 | if (parallel <= 0) lmbench_usage(ac, av, usage); | ^~~~~~~~~~~~~ lat_ops.c: En la función ‘main’: lat_ops.c:393:23: aviso: declaración implícita de la función ‘lmbench_usage’ [-Wimplicit-function-declaration] 393 | if (parallel <= 0) lmbench_usage(ac, av, usage); | ^~~~~~~~~~~~~ line.c: En la función ‘main’: line.c:54:4: aviso: declaración implícita de la función ‘lmbench_usage’ [-Wimplicit-function-declaration] 54 | lmbench_usage(ac, av, usage); | ^~~~~~~~~~~~~ tlb.c: En la función ‘main’: tlb.c:69:4: aviso: declaración implícita de la función ‘lmbench_usage’ [-Wimplicit-function-declaration] 69 | lmbench_usage(ac, av, usage); | ^~~~~~~~~~~~~ par_mem.c: En la función ‘main’: par_mem.c:64:4: aviso: declaración implícita de la función ‘lmbench_usage’ [-Wimplicit-function-declaration] 64 | lmbench_usage(ac, av, usage); | ^~~~~~~~~~~~~ par_ops.c: En la función ‘main’: par_ops.c:413:4: aviso: declaración implícita de la función ‘lmbench_usage’ [-Wimplicit-function-declaration] 413 | lmbench_usage(ac, av, usage); | ^~~~~~~~~~~~~ stream.c: En la función ‘main’: stream.c:70:5: aviso: declaración implícita de la función ‘lmbench_usage’ [-Wimplicit-function-declaration] 70 | lmbench_usage(ac, av, usage); | ^~~~~~~~~~~~~ cache.c: En la función ‘main’: cache.c:123:4: aviso: declaración implícita de la función ‘lmbench_usage’ [-Wimplicit-function-declaration] 123 | lmbench_usage(ac, av, usage); | ^~~~~~~~~~~~~ lat_dram_page.c: En la función ‘main’: lat_dram_page.c:66:4: aviso: declaración implícita de la función ‘lmbench_usage’ [-Wimplicit-function-declaration] 66 | lmbench_usage(ac, av, usage); | ^~~~~~~~~~~~~ lat_pmake.c: En la función ‘main’: lat_pmake.c:47:23: aviso: declaración implícita de la función ‘lmbench_usage’ [-Wimplicit-function-declaration] 47 | if (parallel <= 0) lmbench_usage(ac, av, usage); | ^~~~~~~~~~~~~ lat_rand.c: En la función ‘main’: lat_rand.c:39:23: aviso: declaración implícita de la función ‘lmbench_usage’ [-Wimplicit-function-declaration] 39 | if (parallel <= 0) lmbench_usage(ac, av, usage); | ^~~~~~~~~~~~~ lat_usleep.c: En la función ‘main’: lat_usleep.c:204:3: aviso: declaración implícita de la función ‘lmbench_usage’ [-Wimplicit-function-declaration] 204 | lmbench_usage(ac, av, usage); | ^~~~~~~~~~~~~ lat_cmd.c: En la función ‘main’: lat_cmd.c:40:23: aviso: declaración implícita de la función ‘lmbench_usage’ [-Wimplicit-function-declaration] 40 | if (parallel <= 0) lmbench_usage(ac, av, usage); | ^~~~~~~~~~~~~ 1280MB OK 1280MB OK 1280MB OK mhz: should take approximately 297 seconds Using config in CONFIG.localhost.localdomain mar 23 jun 2020 21:09:31 -03 Latency measurements mar 23 jun 2020 21:18:26 -03 Calculating file system latency mar 23 jun 2020 21:43:17 -03 Local networking mar 23 jun 2020 21:48:59 -03 Bandwidth measurements mar 23 jun 2020 22:53:56 -03 Calculating context switch overhead mar 23 jun 2020 23:05:05 -03 /bin/sh: ../scripts/getlist: Permiso denegado /bin/sh: ../scripts/getsummary: Permiso denegado make: *** [Makefile:110: summary] Error 126 ./performance/lmbench3 PASS Test suite complete PASS Your log file is being submitted... Upload successful! The following information is not submitted with your log; it is for informational purposes only. Checking for kernel signature: The signer's common name is Fedora Secure Boot Signer Vulnerability status: /sys/devices/system/cpu/vulnerabilities/itlb_multihit:KVM: Vulnerable /sys/devices/system/cpu/vulnerabilities/l1tf:Mitigation: PTE Inversion /sys/devices/system/cpu/vulnerabilities/mds:Vulnerable: Clear CPU buffers attempted, no microcode; SMT Host state unknown /sys/devices/system/cpu/vulnerabilities/meltdown:Mitigation: PTI /sys/devices/system/cpu/vulnerabilities/spec_store_bypass:Vulnerable /sys/devices/system/cpu/vulnerabilities/spectre_v1:Mitigation: usercopy/swapgs barriers and __user pointer sanitization /sys/devices/system/cpu/vulnerabilities/spectre_v2:Mitigation: Full generic retpoline, STIBP: disabled, RSB filling /sys/devices/system/cpu/vulnerabilities/srbds:Not affected /sys/devices/system/cpu/vulnerabilities/tsx_async_abort:Not affected
masch ThinkPad X1 Yoga 4th 145 - 14.7 GiB - Intel® Core™ i7-8565U CPU @ 1.80GHz × 8 - Mesa Intel® UHD Graphics 620 (WHL GT2) [1] 1. Test suite called with default ./default/paxtest SKIP ./default/posix_timers PASS ./default/mq-memory-corruption PASS ./default/selinux-dac-controls PASS ./default/stack-randomness PASS ./default/cachedrop PASS ./default/sysfs-perms PASS ./default/memfd PASS ./default/insert_leap_second PASS ./default/libhugetlbfs SKIP ./default/timer-overhead PASS ./default/modsign PASS Test suite complete PASS Your log file is being submitted... Upload successful! The following information is not submitted with your log; it is for informational purposes only. Checking for kernel signature: The signer's common name is Fedora Secure Boot Signer Vulnerability status: /sys/devices/system/cpu/vulnerabilities/itlb_multihit:Not affected /sys/devices/system/cpu/vulnerabilities/l1tf:Not affected /sys/devices/system/cpu/vulnerabilities/mds:Not affected /sys/devices/system/cpu/vulnerabilities/meltdown:Not affected /sys/devices/system/cpu/vulnerabilities/spec_store_bypass:Mitigation: Speculative Store Bypass disabled via prctl and seccomp /sys/devices/system/cpu/vulnerabilities/spectre_v1:Mitigation: usercopy/swapgs barriers and __user pointer sanitization /sys/devices/system/cpu/vulnerabilities/spectre_v2:Mitigation: Enhanced IBRS, IBPB: conditional, RSB filling /sys/devices/system/cpu/vulnerabilities/srbds:Mitigation: TSX disabled /sys/devices/system/cpu/vulnerabilities/tsx_async_abort:Not affected [masch@localhost kernel-tests]$ sudo ./runtests.sh -t performance Test suite called with performance In file included from lib_tcp.c:9: bench.h:38:10: fatal error: rpc/rpc.h: No such file or directory 38 | #include <rpc/rpc.h> | ^~~~~~~~~~~ compilation terminated. gmake[2]: *** [Makefile:244: ../bin/x86_64-linux-gnu/lib_tcp.o] Error 1 make[1]: *** [Makefile:114: lmbench] Error 2 make: *** [Makefile:20: build] Error 2 In file included from lib_tcp.c:9: bench.h:38:10: fatal error: rpc/rpc.h: No such file or directory 38 | #include <rpc/rpc.h> | ^~~~~~~~~~~ compilation terminated. gmake[2]: *** [Makefile:244: ../bin/x86_64-linux-gnu/lib_tcp.o] Error 1 make[1]: *** [Makefile:114: lmbench] Error 2 make: *** [Makefile:23: results] Error 2 /bin/sh: ../scripts/getlist: Permission denied /bin/sh: ../scripts/getsummary: Permission denied make: *** [Makefile:110: summary] Error 126 ./performance/lmbench3 PASS Test suite complete PASS Your log file is being submitted... Upload successful! The following information is not submitted with your log; it is for informational purposes only. Checking for kernel signature: The signer's common name is Fedora Secure Boot Signer Vulnerability status: /sys/devices/system/cpu/vulnerabilities/itlb_multihit:Not affected /sys/devices/system/cpu/vulnerabilities/l1tf:Not affected /sys/devices/system/cpu/vulnerabilities/mds:Not affected /sys/devices/system/cpu/vulnerabilities/meltdown:Not affected /sys/devices/system/cpu/vulnerabilities/spec_store_bypass:Mitigation: Speculative Store Bypass disabled via prctl and seccomp /sys/devices/system/cpu/vulnerabilities/spectre_v1:Mitigation: usercopy/swapgs barriers and __user pointer sanitization /sys/devices/system/cpu/vulnerabilities/spectre_v2:Mitigation: Enhanced IBRS, IBPB: conditional, RSB filling /sys/devices/system/cpu/vulnerabilities/srbds:Mitigation: TSX disabled /sys/devices/system/cpu/vulnerabilities/tsx_async_abort:Not affected
mharpau Thinkpad T480s, i5-8250U, iGPU [1] 1. All tests passed and everything OK.
mikoim ASRock X299 Taichi XE, Intel(R) Core(TM) i9-7980XE, NVIDIA GeForce GTX 1050 Ti
mr2dave AMD Pinnacle Ridge on B450 board. [1] 1. sysfs-perms: WARN in default tests. Performance tests passed.
mr2dave Dell G5 SE (5505) AMD Renoir + Navi 10 [1] 1. Still need to use "amdgpu.runpm=0" switch at boot else it will freeze after loading the desktop, but no regressions.
mzink ThinkPad T480s [1] 1. Test suite called with default ./default/selinux-dac-controls PASS ./default/insert_leap_second PASS ./default/cachedrop PASS ./default/libhugetlbfs SKIP ./default/stack-randomness PASS ./default/memfd PASS ./default/paxtest SKIP ./default/posix_timers PASS ./default/sysfs-perms PASS ./default/mq-memory-corruption PASS ./default/timer-overhead PASS ./default/modsign PASS Test suite complete PASS
nasirhm KVM/QEMU on Lenovo Thinkpad X1 Carbon [1] 1. Vulnerability status: /sys/devices/system/cpu/vulnerabilities/itlb_multihit:KVM: Mitigation: Split huge pages /sys/devices/system/cpu/vulnerabilities/l1tf:Mitigation: PTE Inversion; VMX: flush not necessary, SMT disabled /sys/devices/system/cpu/vulnerabilities/mds:Mitigation: Clear CPU buffers; SMT Host state unknown /sys/devices/system/cpu/vulnerabilities/meltdown:Mitigation: PTI /sys/devices/system/cpu/vulnerabilities/spec_store_bypass:Mitigation: Speculative Store Bypass disabled via prctl and seccomp /sys/devices/system/cpu/vulnerabilities/spectre_v1:Mitigation: usercopy/swapgs barriers and __user pointer sanitization /sys/devices/system/cpu/vulnerabilities/spectre_v2:Mitigation: Full generic retpoline, IBPB: conditional, IBRS_FW, STIBP: disabled, RSB filling /sys/devices/system/cpu/vulnerabilities/srbds:Unknown: Dependent on hypervisor status /sys/devices/system/cpu/vulnerabilities/tsx_async_abort:Mitigation: Clear CPU buffers; SMT Host state unknown
nchudnoff Phenom II x4 B93, 6GB RAM under QEMU/KVM [1] 1. Default test suite: libhugetlbfs and paxtest SKIP, all other PASS. Performance test: PASS
nielsenb Compaq 8510w Intel T9300 AMD RV630
norbertj Desktop with Ryzen 3 3200G and 16 GiB RAM [1] 1. Default and performance tests passed (paxtest and libhugetlbfs skipped). No regressions noted.
norbertj Ideapad with Core i3-6006U and 8 GiB memory [1] 1. Default and performance test passed (paxtest and libhugetlbfs skipped). No regressions noted.
norbertj Old desktop with Core i5 750, 4 GiB RAM and Radeon HD 6450 [1] 1. Default tests passed (paxtest and libhugetlbfs skipped). Performance tests got stuck at Latency measurements, probably because /var/tmp was filled up to 100% by file "XXX", probably due to lack of RAM. No regressions noted.
orzechot
paninaro [1] 1. I suggest in the next live iso to add the libtirpc-devel packages so users dont need to install anything extra to run the performance test
pany MacBook Pro (Retina, 13-inch, Early 2015), i5-5257U, 8G MEM [1] 1. Test suite called with default Test suite complete PASS ./performance/lmbench3 PASS
pvvmayur Tested on Virtual Machine. ASUS ROG Strix G G731GT Model No: G731GT-AU016T - 17.3" Screen, GTX 1650 4GB Graphics, Intel Core i7-9750H 9th Gen, 8GB RAM, 1TB SSHD, 256GB PCIe SSD [1] 1. Default test suite and performance test suite passed.
pwhalen AMD Seattle (aarch64)
pwhalen BeagleBone Black (armhfp) [1] 1. ./default/insert_leap_second FAIL
pwhalen Lenovo ThinkSystem HR350A (aarch64) [1] 1. /sys/devices/system/cpu/vulnerabilities/spec_store_bypass:Vulnerable /sys/devices/system/cpu/vulnerabilities/spectre_v2:Vulnerable
pwhalen Raspberry Pi 3B (armhfp) [1] 1. ./default/insert_leap_second FAIL ./default/cachedrop FAIL
pwhalen Raspberry Pi 4B (4GB) - AArch64 [1] 1. /sys/devices/system/cpu/vulnerabilities/spec_store_bypass:Vulnerable
pwhalen Wandboard Quad (armhfp) [1] 1. ./default/insert_leap_second FAIL
qiankehan AMD EPYC 7251 8-Core Processor, qemu-kvm-5.0.0-0.module+el8.3.0+6620+5d5e1420.x86_64, KVM host-passthrough VM,1048576 KiB RAM [1] 1. 1. default test suite: ./default/cachedrop PASS ./default/libhugetlbfs SKIP ./default/mq-memory-corruption PASS ./default/sysfs-perms PASS ./default/insert_leap_second PASS ./default/selinux-dac-controls PASS ./default/timer-overhead PASS ./default/posix_timers PASS ./default/memfd PASS ./default/stack-randomness PASS ./default/paxtest SKIP ./default/modsign SKIP Test suite complete PASS 2. performance test suite: ./performance/lmbench3 PASS Test suite complete PASS
quiet RAM 4.7GB, CPU Skylake (IBRS) x2, GPU llvmpipe (LLVM 10.0.0, 256 bits), HDD 21.5 GB, Fedora 32 Workstation, 64-bit, GNOME 3.36.3, Wayland, KVM, fully updated [1] 1. Test suite called with default ./default/cachedrop PASS ./default/memfd PASS ./default/selinux-dac-controls PASS ./default/stack-randomness PASS ./default/paxtest SKIP ./default/sysfs-perms PASS ./default/timer-overhead PASS ./default/insert_leap_second PASS ./default/mq-memory-corruption PASS ./default/libhugetlbfs SKIP ./default/posix_timers PASS ./default/modsign PASS Test suite complete PASS /bin/sh: ../scripts/getlist: Permission denied /bin/sh: ../scripts/getsummary: Permission denied make: *** [Makefile:110: summary] Error 126 ./performance/lmbench3 PASS Test suite complete PASS
rootxaman Acer Predator Helios 300 Fedora Workstation Fedora 32: x86_64 Intel© Core™ i5-8300H CPU @ 2.30GHz × 4 Memory:7.6 GiB Intel Corporation UHD Graphics 630 (Mobile) (prog-if 00 [VGA controller]) NVIDIA Corporation GP107M [GeForce GTX 1050 Ti Mobile] [1] 1. ./default/timer-overhead PASS ./default/posix_timers PASS ./default/stack-randomness PASS ./default/selinux-dac-controls PASS ./default/sysfs-perms PASS ./default/cachedrop PASS ./default/paxtest SKIP ./default/libhugetlbfs SKIP ./default/memfd PASS ./default/modsign PASS ./default/mq-memory-corruption PASS ./default/insert_leap_second PASS Test suite complete PASS /sys/devices/system/cpu/vulnerabilities/itlb_multihit:KVM: Mitigation: Split huge pages /sys/devices/system/cpu/vulnerabilities/l1tf:Mitigation: PTE Inversion; VMX: conditional cache flushes, SMT vulnerable /sys/devices/system/cpu/vulnerabilities/mds:Mitigation: Clear CPU buffers; SMT vulnerable /sys/devices/system/cpu/vulnerabilities/meltdown:Mitigation: PTI /sys/devices/system/cpu/vulnerabilities/spec_store_bypass:Mitigation: Speculative Store Bypass disabled via prctl and seccomp /sys/devices/system/cpu/vulnerabilities/spectre_v1:Mitigation: usercopy/swapgs barriers and __user pointer sanitization /sys/devices/system/cpu/vulnerabilities/spectre_v2:Mitigation: Full generic retpoline, IBPB: conditional, IBRS_FW, STIBP: conditional, RSB filling /sys/devices/system/cpu/vulnerabilities/srbds:Vulnerable: No microcode /sys/devices/system/cpu/vulnerabilities/tsx_async_abort:Not affected make: Warning: File 'Makefile' has modification time 11041 s in the future make[1]: Warning: File 'Makefile' has modification time 11041 s in the future gmake[2]: Warning: File 'Makefile' has modification time 11040 s in the future lib_timing.c: In function ‘touch’: lib_timing.c:1626:9: warning: type defaults to ‘int’ in declaration of ‘psize’ [-Wimplicit-int] 1626 | static psize; | ^~~~~ lib_sched.c: In function ‘handle_scheduler’: lib_sched.c:94:3: warning: ‘return’ with no value, in function returning non-void 94 | return; | ^~~~~~ lib_sched.c:46:1: note: declared here 46 | handle_scheduler(int childno, int benchproc, int nbenchprocs) | ^~~~~~~~~~~~~~~~ lib_sched.c: In function ‘sched_pin’: lib_sched.c:207:12: warning: implicit declaration of function ‘sched_getaffinity’ [-Wimplicit-function-declaration] 207 | retval = sched_getaffinity(0, sz * sizeof(unsigned long), cpumask); | ^~~~~~~~~~~~~~~~~ lib_sched.c:231:11: warning: implicit declaration of function ‘sched_setaffinity’ [-Wimplicit-function-declaration] 231 | retval = sched_setaffinity(0, sz * sizeof(unsigned long), mask); | ^~~~~~~~~~~~~~~~~ bw_file_rd.c: In function ‘main’: bw_file_rd.c:149:23: warning: implicit declaration of function ‘lmbench_usage’ [-Wimplicit-function-declaration] 149 | if (parallel <= 0) lmbench_usage(ac, av, usage); | ^~~~~~~~~~~~~ bw_mem.c: In function ‘main’: bw_mem.c:76:23: warning: implicit declaration of function ‘lmbench_usage’ [-Wimplicit-function-declaration] 76 | if (parallel <= 0) lmbench_usage(ac, av, usage); | ^~~~~~~~~~~~~ bw_mmap_rd.c: In function ‘main’: bw_mmap_rd.c:64:23: warning: implicit declaration of function ‘lmbench_usage’ [-Wimplicit-function-declaration] 64 | if (parallel <= 0) lmbench_usage(ac, av, usage); | ^~~~~~~~~~~~~ bw_pipe.c: In function ‘main’: bw_pipe.c:157:23: warning: implicit declaration of function ‘lmbench_usage’ [-Wimplicit-function-declaration] 157 | if (parallel <= 0) lmbench_usage(ac, av, usage); | ^~~~~~~~~~~~~ bw_tcp.c: In function ‘main’: bw_tcp.c:74:23: warning: implicit declaration of function ‘lmbench_usage’ [-Wimplicit-function-declaration] 74 | if (parallel <= 0) lmbench_usage(ac, av, usage); | ^~~~~~~~~~~~~ bw_unix.c: In function ‘main’: bw_unix.c:153:23: warning: implicit declaration of function ‘lmbench_usage’ [-Wimplicit-function-declaration] 153 | if (parallel <= 0) lmbench_usage(argc, argv, usage); | ^~~~~~~~~~~~~ lat_select.c: In function ‘main’: lat_select.c:53:23: warning: implicit declaration of function ‘lmbench_usage’ [-Wimplicit-function-declaration] 53 | if (parallel <= 0) lmbench_usage(ac, av, usage); | ^~~~~~~~~~~~~ lat_select.c: In function ‘doit’: lat_select.c:167:9: warning: type defaults to ‘int’ in declaration of ‘count’ [-Wimplicit-int] 167 | static count = 0; | ^~~~~ lat_pipe.c: In function ‘main’: lat_pipe.c:41:23: warning: implicit declaration of function ‘lmbench_usage’ [-Wimplicit-function-declaration] 41 | if (parallel <= 0) lmbench_usage(ac, av, usage); | ^~~~~~~~~~~~~ lat_rpc.c: In function ‘main’: lat_rpc.c:136:5: warning: implicit declaration of function ‘lmbench_usage’ [-Wimplicit-function-declaration] 136 | lmbench_usage(ac, av, usage); | ^~~~~~~~~~~~~ lat_syscall.c: In function ‘main’: lat_syscall.c:116:23: warning: implicit declaration of function ‘lmbench_usage’ [-Wimplicit-function-declaration] 116 | if (parallel <= 0) lmbench_usage(ac, av, usage); | ^~~~~~~~~~~~~ lat_tcp.c: In function ‘main’: lat_tcp.c:64:5: warning: implicit declaration of function ‘lmbench_usage’ [-Wimplicit-function-declaration] 64 | lmbench_usage(ac, av, usage); | ^~~~~~~~~~~~~ lat_udp.c: In function ‘main’: lat_udp.c:78:5: warning: implicit declaration of function ‘lmbench_usage’ [-Wimplicit-function-declaration] 78 | lmbench_usage(ac, av, usage); | ^~~~~~~~~~~~~ lat_mmap.c: In function ‘main’: lat_mmap.c:58:5: warning: implicit declaration of function ‘lmbench_usage’ [-Wimplicit-function-declaration] 58 | lmbench_usage(ac, av, usage); | ^~~~~~~~~~~~~ mhz.c: In function ‘main’: mhz.c:492:4: warning: implicit declaration of function ‘lmbench_usage’ [-Wimplicit-function-declaration] 492 | lmbench_usage(ac, av, usage); | ^~~~~~~~~~~~~ lat_proc.c: In function ‘main’: lat_proc.c:60:23: warning: implicit declaration of function ‘lmbench_usage’ [-Wimplicit-function-declaration] 60 | if (parallel <= 0) lmbench_usage(ac, av, usage); | ^~~~~~~~~~~~~ lat_pagefault.c: In function ‘main’: lat_pagefault.c:54:23: warning: implicit declaration of function ‘lmbench_usage’ [-Wimplicit-function-declaration] 54 | if (parallel <= 0) lmbench_usage(ac, av, usage); | ^~~~~~~~~~~~~ lat_connect.c: In function ‘main’: lat_connect.c:63:4: warning: implicit declaration of function ‘lmbench_usage’ [-Wimplicit-function-declaration] 63 | lmbench_usage(ac, av, usage); | ^~~~~~~~~~~~~ lat_fs.c: In function ‘main’: lat_fs.c:55:23: warning: implicit declaration of function ‘lmbench_usage’ [-Wimplicit-function-declaration] 55 | if (parallel <= 0) lmbench_usage(ac, av, usage); | ^~~~~~~~~~~~~ /usr/bin/ld: /tmp/ccuu7y4G.o: in function `setup_names': lat_fs.c:(.text+0x831): warning: the use of `tempnam' is dangerous, better use `mkstemp' lat_sig.c: In function ‘main’: lat_sig.c:182:23: warning: implicit declaration of function ‘lmbench_usage’ [-Wimplicit-function-declaration] 182 | if (parallel <= 0) lmbench_usage(ac, av, usage); | ^~~~~~~~~~~~~ lat_mem_rd.c: In function ‘main’: lat_mem_rd.c:47:23: warning: implicit declaration of function ‘lmbench_usage’ [-Wimplicit-function-declaration] 47 | if (parallel <= 0) lmbench_usage(ac, av, usage); | ^~~~~~~~~~~~~ lat_ctx.c: In function ‘main’: lat_ctx.c:74:23: warning: implicit declaration of function ‘lmbench_usage’ [-Wimplicit-function-declaration] 74 | if (parallel <= 0) lmbench_usage(ac, av, usage); | ^~~~~~~~~~~~~ lat_sem.c: In function ‘main’: lat_sem.c:42:23: warning: implicit declaration of function ‘lmbench_usage’ [-Wimplicit-function-declaration] 42 | if (parallel <= 0) lmbench_usage(ac, av, usage); | ^~~~~~~~~~~~~ lat_unix.c: In function ‘main’: lat_unix.c:46:23: warning: implicit declaration of function ‘lmbench_usage’ [-Wimplicit-function-declaration] 46 | if (parallel <= 0) lmbench_usage(ac, av, usage); | ^~~~~~~~~~~~~ lat_fifo.c: In function ‘main’: lat_fifo.c:45:23: warning: implicit declaration of function ‘lmbench_usage’ [-Wimplicit-function-declaration] 45 | if (parallel <= 0) lmbench_usage(ac, av, usage); | ^~~~~~~~~~~~~ lat_http.c: In function ‘main’: lat_http.c:84:4: warning: implicit declaration of function ‘lmbench_usage’ [-Wimplicit-function-declaration] 84 | lmbench_usage(ac, av, usage); | ^~~~~~~~~~~~~ lat_fcntl.c: In function ‘main’: lat_fcntl.c:203:23: warning: implicit declaration of function ‘lmbench_usage’ [-Wimplicit-function-declaration] 203 | if (parallel <= 0) lmbench_usage(ac, av, usage); | ^~~~~~~~~~~~~ lat_unix_connect.c: In function ‘main’: lat_unix_connect.c:63:23: warning: implicit declaration of function ‘lmbench_usage’ [-Wimplicit-function-declaration] 63 | if (parallel <= 0) lmbench_usage(ac, av, usage); | ^~~~~~~~~~~~~ lat_ops.c: In function ‘main’: lat_ops.c:393:23: warning: implicit declaration of function ‘lmbench_usage’ [-Wimplicit-function-declaration] 393 | if (parallel <= 0) lmbench_usage(ac, av, usage); | ^~~~~~~~~~~~~ line.c: In function ‘main’: line.c:54:4: warning: implicit declaration of function ‘lmbench_usage’ [-Wimplicit-function-declaration] 54 | lmbench_usage(ac, av, usage); | ^~~~~~~~~~~~~ tlb.c: In function ‘main’: tlb.c:69:4: warning: implicit declaration of function ‘lmbench_usage’ [-Wimplicit-function-declaration] 69 | lmbench_usage(ac, av, usage); | ^~~~~~~~~~~~~ par_mem.c: In function ‘main’: par_mem.c:64:4: warning: implicit declaration of function ‘lmbench_usage’ [-Wimplicit-function-declaration] 64 | lmbench_usage(ac, av, usage); | ^~~~~~~~~~~~~ par_ops.c: In function ‘main’: par_ops.c:413:4: warning: implicit declaration of function ‘lmbench_usage’ [-Wimplicit-function-declaration] 413 | lmbench_usage(ac, av, usage); | ^~~~~~~~~~~~~ stream.c: In function ‘main’: stream.c:70:5: warning: implicit declaration of function ‘lmbench_usage’ [-Wimplicit-function-declaration] 70 | lmbench_usage(ac, av, usage); | ^~~~~~~~~~~~~ gmake[2]: warning: Clock skew detected. Your build may be incomplete. gmake[2]: Warning: File 'Makefile' has modification time 11025 s in the future lib_timing.c: In function ‘touch’: lib_timing.c:1626:9: warning: type defaults to ‘int’ in declaration of ‘psize’ [-Wimplicit-int] 1626 | static psize; | ^~~~~ lib_sched.c: In function ‘handle_scheduler’: lib_sched.c:94:3: warning: ‘return’ with no value, in function returning non-void 94 | return; | ^~~~~~ lib_sched.c:46:1: note: declared here 46 | handle_scheduler(int childno, int benchproc, int nbenchprocs) | ^~~~~~~~~~~~~~~~ lib_sched.c: In function ‘sched_pin’: lib_sched.c:207:12: warning: implicit declaration of function ‘sched_getaffinity’ [-Wimplicit-function-declaration] 207 | retval = sched_getaffinity(0, sz * sizeof(unsigned long), cpumask); | ^~~~~~~~~~~~~~~~~ lib_sched.c:231:11: warning: implicit declaration of function ‘sched_setaffinity’ [-Wimplicit-function-declaration] 231 | retval = sched_setaffinity(0, sz * sizeof(unsigned long), mask); | ^~~~~~~~~~~~~~~~~ cache.c: In function ‘main’: cache.c:123:4: warning: implicit declaration of function ‘lmbench_usage’ [-Wimplicit-function-declaration] 123 | lmbench_usage(ac, av, usage); | ^~~~~~~~~~~~~ lat_dram_page.c: In function ‘main’: lat_dram_page.c:66:4: warning: implicit declaration of function ‘lmbench_usage’ [-Wimplicit-function-declaration] 66 | lmbench_usage(ac, av, usage); | ^~~~~~~~~~~~~ lat_pmake.c: In function ‘main’: lat_pmake.c:47:23: warning: implicit declaration of function ‘lmbench_usage’ [-Wimplicit-function-declaration] 47 | if (parallel <= 0) lmbench_usage(ac, av, usage); | ^~~~~~~~~~~~~ lat_rand.c: In function ‘main’: lat_rand.c:39:23: warning: implicit declaration of function ‘lmbench_usage’ [-Wimplicit-function-declaration] 39 | if (parallel <= 0) lmbench_usage(ac, av, usage); | ^~~~~~~~~~~~~ lat_usleep.c: In function ‘main’: lat_usleep.c:204:3: warning: implicit declaration of function ‘lmbench_usage’ [-Wimplicit-function-declaration] 204 | lmbench_usage(ac, av, usage); | ^~~~~~~~~~~~~ lat_cmd.c: In function ‘main’: lat_cmd.c:40:23: warning: implicit declaration of function ‘lmbench_usage’ [-Wimplicit-function-declaration] 40 | if (parallel <= 0) lmbench_usage(ac, av, usage); | ^~~~~~~~~~~~~ gmake[2]: warning: Clock skew detected. Your build may be incomplete. make[1]: warning: Clock skew detected. Your build may be incomplete. make: warning: Clock skew detected. Your build may be incomplete. make: Warning: File 'Makefile' has modification time 11022 s in the future make[1]: Warning: File 'Makefile' has modification time 11022 s in the future gmake[2]: Warning: File 'Makefile' has modification time 11022 s in the future lib_timing.c: In function ‘touch’: lib_timing.c:1626:9: warning: type defaults to ‘int’ in declaration of ‘psize’ [-Wimplicit-int] 1626 | static psize; | ^~~~~ lib_sched.c: In function ‘handle_scheduler’: lib_sched.c:94:3: warning: ‘return’ with no value, in function returning non-void 94 | return; | ^~~~~~ lib_sched.c:46:1: note: declared here 46 | handle_scheduler(int childno, int benchproc, int nbenchprocs) | ^~~~~~~~~~~~~~~~ lib_sched.c: In function ‘sched_pin’: lib_sched.c:207:12: warning: implicit declaration of function ‘sched_getaffinity’ [-Wimplicit-function-declaration] 207 | retval = sched_getaffinity(0, sz * sizeof(unsigned long), cpumask); | ^~~~~~~~~~~~~~~~~ lib_sched.c:231:11: warning: implicit declaration of function ‘sched_setaffinity’ [-Wimplicit-function-declaration] 231 | retval = sched_setaffinity(0, sz * sizeof(unsigned long), mask); | ^~~~~~~~~~~~~~~~~ bw_file_rd.c: In function ‘main’: bw_file_rd.c:149:23: warning: implicit declaration of function ‘lmbench_usage’ [-Wimplicit-function-declaration] 149 | if (parallel <= 0) lmbench_usage(ac, av, usage); | ^~~~~~~~~~~~~ bw_mem.c: In function ‘main’: bw_mem.c:76:23: warning: implicit declaration of function ‘lmbench_usage’ [-Wimplicit-function-declaration] 76 | if (parallel <= 0) lmbench_usage(ac, av, usage); | ^~~~~~~~~~~~~ bw_mmap_rd.c: In function ‘main’: bw_mmap_rd.c:64:23: warning: implicit declaration of function ‘lmbench_usage’ [-Wimplicit-function-declaration] 64 | if (parallel <= 0) lmbench_usage(ac, av, usage); | ^~~~~~~~~~~~~ bw_pipe.c: In function ‘main’: bw_pipe.c:157:23: warning: implicit declaration of function ‘lmbench_usage’ [-Wimplicit-function-declaration] 157 | if (parallel <= 0) lmbench_usage(ac, av, usage); | ^~~~~~~~~~~~~ bw_tcp.c: In function ‘main’: bw_tcp.c:74:23: warning: implicit declaration of function ‘lmbench_usage’ [-Wimplicit-function-declaration] 74 | if (parallel <= 0) lmbench_usage(ac, av, usage); | ^~~~~~~~~~~~~ bw_unix.c: In function ‘main’: bw_unix.c:153:23: warning: implicit declaration of function ‘lmbench_usage’ [-Wimplicit-function-declaration] 153 | if (parallel <= 0) lmbench_usage(argc, argv, usage); | ^~~~~~~~~~~~~ lat_select.c: In function ‘main’: lat_select.c:53:23: warning: implicit declaration of function ‘lmbench_usage’ [-Wimplicit-function-declaration] 53 | if (parallel <= 0) lmbench_usage(ac, av, usage); | ^~~~~~~~~~~~~ lat_select.c: In function ‘doit’: lat_select.c:167:9: warning: type defaults to ‘int’ in declaration of ‘count’ [-Wimplicit-int] 167 | static count = 0; | ^~~~~ lat_pipe.c: In function ‘main’: lat_pipe.c:41:23: warning: implicit declaration of function ‘lmbench_usage’ [-Wimplicit-function-declaration] 41 | if (parallel <= 0) lmbench_usage(ac, av, usage); | ^~~~~~~~~~~~~ lat_rpc.c: In function ‘main’: lat_rpc.c:136:5: warning: implicit declaration of function ‘lmbench_usage’ [-Wimplicit-function-declaration] 136 | lmbench_usage(ac, av, usage); | ^~~~~~~~~~~~~ lat_syscall.c: In function ‘main’: lat_syscall.c:116:23: warning: implicit declaration of function ‘lmbench_usage’ [-Wimplicit-function-declaration] 116 | if (parallel <= 0) lmbench_usage(ac, av, usage); | ^~~~~~~~~~~~~ lat_tcp.c: In function ‘main’: lat_tcp.c:64:5: warning: implicit declaration of function ‘lmbench_usage’ [-Wimplicit-function-declaration] 64 | lmbench_usage(ac, av, usage); | ^~~~~~~~~~~~~ lat_udp.c: In function ‘main’: lat_udp.c:78:5: warning: implicit declaration of function ‘lmbench_usage’ [-Wimplicit-function-declaration] 78 | lmbench_usage(ac, av, usage); | ^~~~~~~~~~~~~ lat_mmap.c: In function ‘main’: lat_mmap.c:58:5: warning: implicit declaration of function ‘lmbench_usage’ [-Wimplicit-function-declaration] 58 | lmbench_usage(ac, av, usage); | ^~~~~~~~~~~~~ mhz.c: In function ‘main’: mhz.c:492:4: warning: implicit declaration of function ‘lmbench_usage’ [-Wimplicit-function-declaration] 492 | lmbench_usage(ac, av, usage); | ^~~~~~~~~~~~~ lat_proc.c: In function ‘main’: lat_proc.c:60:23: warning: implicit declaration of function ‘lmbench_usage’ [-Wimplicit-function-declaration] 60 | if (parallel <= 0) lmbench_usage(ac, av, usage); | ^~~~~~~~~~~~~ lat_pagefault.c: In function ‘main’: lat_pagefault.c:54:23: warning: implicit declaration of function ‘lmbench_usage’ [-Wimplicit-function-declaration] 54 | if (parallel <= 0) lmbench_usage(ac, av, usage); | ^~~~~~~~~~~~~ lat_connect.c: In function ‘main’: lat_connect.c:63:4: warning: implicit declaration of function ‘lmbench_usage’ [-Wimplicit-function-declaration] 63 | lmbench_usage(ac, av, usage); | ^~~~~~~~~~~~~ lat_fs.c: In function ‘main’: lat_fs.c:55:23: warning: implicit declaration of function ‘lmbench_usage’ [-Wimplicit-function-declaration] 55 | if (parallel <= 0) lmbench_usage(ac, av, usage); | ^~~~~~~~~~~~~ /usr/bin/ld: /tmp/cc0vMHdr.o: in function `setup_names': lat_fs.c:(.text+0x831): warning: the use of `tempnam' is dangerous, better use `mkstemp' lat_sig.c: In function ‘main’: lat_sig.c:182:23: warning: implicit declaration of function ‘lmbench_usage’ [-Wimplicit-function-declaration] 182 | if (parallel <= 0) lmbench_usage(ac, av, usage); | ^~~~~~~~~~~~~ lat_mem_rd.c: In function ‘main’: lat_mem_rd.c:47:23: warning: implicit declaration of function ‘lmbench_usage’ [-Wimplicit-function-declaration] 47 | if (parallel <= 0) lmbench_usage(ac, av, usage); | ^~~~~~~~~~~~~ lat_ctx.c: In function ‘main’: lat_ctx.c:74:23: warning: implicit declaration of function ‘lmbench_usage’ [-Wimplicit-function-declaration] 74 | if (parallel <= 0) lmbench_usage(ac, av, usage); | ^~~~~~~~~~~~~ lat_sem.c: In function ‘main’: lat_sem.c:42:23: warning: implicit declaration of function ‘lmbench_usage’ [-Wimplicit-function-declaration] 42 | if (parallel <= 0) lmbench_usage(ac, av, usage); | ^~~~~~~~~~~~~ lat_unix.c: In function ‘main’: lat_unix.c:46:23: warning: implicit declaration of function ‘lmbench_usage’ [-Wimplicit-function-declaration] 46 | if (parallel <= 0) lmbench_usage(ac, av, usage); | ^~~~~~~~~~~~~ lat_fifo.c: In function ‘main’: lat_fifo.c:45:23: warning: implicit declaration of function ‘lmbench_usage’ [-Wimplicit-function-declaration] 45 | if (parallel <= 0) lmbench_usage(ac, av, usage); | ^~~~~~~~~~~~~ lat_http.c: In function ‘main’: lat_http.c:84:4: warning: implicit declaration of function ‘lmbench_usage’ [-Wimplicit-function-declaration] 84 | lmbench_usage(ac, av, usage); | ^~~~~~~~~~~~~ lat_fcntl.c: In function ‘main’: lat_fcntl.c:203:23: warning: implicit declaration of function ‘lmbench_usage’ [-Wimplicit-function-declaration] 203 | if (parallel <= 0) lmbench_usage(ac, av, usage); | ^~~~~~~~~~~~~ lat_unix_connect.c: In function ‘main’: lat_unix_connect.c:63:23: warning: implicit declaration of function ‘lmbench_usage’ [-Wimplicit-function-declaration] 63 | if (parallel <= 0) lmbench_usage(ac, av, usage); | ^~~~~~~~~~~~~ lat_ops.c: In function ‘main’: lat_ops.c:393:23: warning: implicit declaration of function ‘lmbench_usage’ [-Wimplicit-function-declaration] 393 | if (parallel <= 0) lmbench_usage(ac, av, usage); | ^~~~~~~~~~~~~ line.c: In function ‘main’: line.c:54:4: warning: implicit declaration of function ‘lmbench_usage’ [-Wimplicit-function-declaration] 54 | lmbench_usage(ac, av, usage); | ^~~~~~~~~~~~~ tlb.c: In function ‘main’: tlb.c:69:4: warning: implicit declaration of function ‘lmbench_usage’ [-Wimplicit-function-declaration] 69 | lmbench_usage(ac, av, usage); | ^~~~~~~~~~~~~ par_mem.c: In function ‘main’: par_mem.c:64:4: warning: implicit declaration of function ‘lmbench_usage’ [-Wimplicit-function-declaration] 64 | lmbench_usage(ac, av, usage); | ^~~~~~~~~~~~~ par_ops.c: In function ‘main’: par_ops.c:413:4: warning: implicit declaration of function ‘lmbench_usage’ [-Wimplicit-function-declaration] 413 | lmbench_usage(ac, av, usage); | ^~~~~~~~~~~~~ stream.c: In function ‘main’: stream.c:70:5: warning: implicit declaration of function ‘lmbench_usage’ [-Wimplicit-function-declaration] 70 | lmbench_usage(ac, av, usage); | ^~~~~~~~~~~~~ gmake[2]: warning: Clock skew detected. Your build may be incomplete. gmake[2]: Warning: File 'Makefile' has modification time 11007 s in the future lib_timing.c: In function ‘touch’: lib_timing.c:1626:9: warning: type defaults to ‘int’ in declaration of ‘psize’ [-Wimplicit-int] 1626 | static psize; | ^~~~~ lib_sched.c: In function ‘handle_scheduler’: lib_sched.c:94:3: warning: ‘return’ with no value, in function returning non-void 94 | return; | ^~~~~~ lib_sched.c:46:1: note: declared here 46 | handle_scheduler(int childno, int benchproc, int nbenchprocs) | ^~~~~~~~~~~~~~~~ lib_sched.c: In function ‘sched_pin’: lib_sched.c:207:12: warning: implicit declaration of function ‘sched_getaffinity’ [-Wimplicit-function-declaration] 207 | retval = sched_getaffinity(0, sz * sizeof(unsigned long), cpumask); | ^~~~~~~~~~~~~~~~~ lib_sched.c:231:11: warning: implicit declaration of function ‘sched_setaffinity’ [-Wimplicit-function-declaration] 231 | retval = sched_setaffinity(0, sz * sizeof(unsigned long), mask); | ^~~~~~~~~~~~~~~~~ cache.c: In function ‘main’: cache.c:123:4: warning: implicit declaration of function ‘lmbench_usage’ [-Wimplicit-function-declaration] 123 | lmbench_usage(ac, av, usage); | ^~~~~~~~~~~~~ lat_dram_page.c: In function ‘main’: lat_dram_page.c:66:4: warning: implicit declaration of function ‘lmbench_usage’ [-Wimplicit-function-declaration] 66 | lmbench_usage(ac, av, usage); | ^~~~~~~~~~~~~ lat_pmake.c: In function ‘main’: lat_pmake.c:47:23: warning: implicit declaration of function ‘lmbench_usage’ [-Wimplicit-function-declaration] 47 | if (parallel <= 0) lmbench_usage(ac, av, usage); | ^~~~~~~~~~~~~ lat_rand.c: In function ‘main’: lat_rand.c:39:23: warning: implicit declaration of function ‘lmbench_usage’ [-Wimplicit-function-declaration] 39 | if (parallel <= 0) lmbench_usage(ac, av, usage); | ^~~~~~~~~~~~~ lat_usleep.c: In function ‘main’: lat_usleep.c:204:3: warning: implicit declaration of function ‘lmbench_usage’ [-Wimplicit-function-declaration] 204 | lmbench_usage(ac, av, usage); | ^~~~~~~~~~~~~ lat_cmd.c: In function ‘main’: lat_cmd.c:40:23: warning: implicit declaration of function ‘lmbench_usage’ [-Wimplicit-function-declaration] 40 | if (parallel <= 0) lmbench_usage(ac, av, usage); | ^~~~~~~~~~~~~ gmake[2]: warning: Clock skew detected. Your build may be incomplete. 5455MB OK 5455MB OK 5455MB OK Using config in CONFIG.amans-pc Mon 22 Jun 2020 04:09:48 PM IST Latency measurements Mon 22 Jun 2020 04:10:19 PM IST Calculating file system latency Mon 22 Jun 2020 04:10:21 PM IST Local networking Mon 22 Jun 2020 04:14:03 PM IST Bandwidth measurements Mon 22 Jun 2020 04:18:54 PM IST Calculating context switch overhead Mon 22 Jun 2020 04:18:58 PM IST make[1]: warning: Clock skew detected. Your build may be incomplete. make: warning: Clock skew detected. Your build may be incomplete. make: Warning: File 'Makefile' has modification time 10432 s in the future make: warning: Clock skew detected. Your build may be incomplete. ./performance/lmbench3 PASS Test suite complete PASS Traceback (most recent call last): File "/usr/lib/python3.8/site-packages/fedora/client/openidbaseclient.py", line 249, in send_request data = output.json() File "/usr/lib/python3.8/site-packages/requests/models.py", line 897, in json return complexjson.loads(self.text, **kwargs) File "/usr/lib64/python3.8/json/__init__.py", line 357, in loads return _default_decoder.decode(s) File "/usr/lib64/python3.8/json/decoder.py", line 337, in decode obj, end = self.raw_decode(s, idx=_w(s, 0).end()) File "/usr/lib64/python3.8/json/decoder.py", line 355, in raw_decode raise JSONDecodeError("Expecting value", s, err.value) from None json.decoder.JSONDecodeError: Expecting value: line 1 column 1 (char 0) During handling of the above exception, another exception occurred: Traceback (most recent call last): File "./fedora_submit.py", line 48, in <module> req = submitclient.send_request( File "/usr/lib/python3.8/site-packages/fedora/client/openidbaseclient.py", line 252, in send_request raise ServerError( fedora.client.ServerError: ServerError(https://apps.fedoraproject.org/kerneltest/upload/anonymous, 413, Error returned from json module while processing b'https://apps.fedoraproject.org/kerneltest/upload/anonymous': b'Expecting value: line 1 column 1 (char 0)' b'<!DOCTYPE HTML PUBLIC "-//W3C//DTD HTML 3.2 Final//EN">\n<title>413 Request Entity Too Large</title>\n<h1>Request Entity Too Large</h1>\n<p>The data value transmitted exceeds the capacity limit.</p>\n') The following information is not submitted with your log; it is for informational purposes only. Vulnerability status: /sys/devices/system/cpu/vulnerabilities/itlb_multihit:KVM: Mitigation: Split huge pages /sys/devices/system/cpu/vulnerabilities/l1tf:Mitigation: PTE Inversion; VMX: conditional cache flushes, SMT vulnerable /sys/devices/system/cpu/vulnerabilities/mds:Mitigation: Clear CPU buffers; SMT vulnerable /sys/devices/system/cpu/vulnerabilities/meltdown:Mitigation: PTI /sys/devices/system/cpu/vulnerabilities/spec_store_bypass:Mitigation: Speculative Store Bypass disabled via prctl and seccomp /sys/devices/system/cpu/vulnerabilities/spectre_v1:Mitigation: usercopy/swapgs barriers and __user pointer sanitization /sys/devices/system/cpu/vulnerabilities/spectre_v2:Mitigation: Full generic retpoline, IBPB: conditional, IBRS_FW, STIBP: conditional, RSB filling /sys/devices/system/cpu/vulnerabilities/srbds:Vulnerable: No microcode /sys/devices/system/cpu/vulnerabilities/tsx_async_abort:Not affected
sagarlk [1] 1. all good
sassam Thinkpad T440s (Intel Core i7-4600U @ 4x 3.3GHz) [1] 1. Passed using F32 5.7.6 kernel from koji. Performed both runtime.sh & runtime.sh -t performance tests.
schminkey Dell XPS 13 9370 [1] 1. All good
sgraf (1) 20HMS1FC02 ThinkPad X270 (2) NUC10i7FNH K61081-303 [1] 1. All good for both. Kernel: 5.7.5-200.fc32.x86_64
sgraf 20HMS1FC02 ThinkPad X270 [1] 1. All good. Kernel: 5.7.5-200.fc32.x86_64 Vulnerability status: /sys/devices/system/cpu/vulnerabilities/itlb_multihit:KVM: Mitigation: Split huge pages /sys/devices/system/cpu/vulnerabilities/l1tf:Mitigation: PTE Inversion; VMX: conditional cache flushes, SMT vulnerable /sys/devices/system/cpu/vulnerabilities/mds:Mitigation: Clear CPU buffers; SMT vulnerable /sys/devices/system/cpu/vulnerabilities/meltdown:Mitigation: PTI /sys/devices/system/cpu/vulnerabilities/spec_store_bypass:Mitigation: Speculative Store Bypass disabled via prctl and seccomp /sys/devices/system/cpu/vulnerabilities/spectre_v1:Mitigation: usercopy/swapgs barriers and __user pointer sanitization /sys/devices/system/cpu/vulnerabilities/spectre_v2:Mitigation: Full generic retpoline, IBPB: conditional, IBRS_FW, STIBP: conditional, RSB filling /sys/devices/system/cpu/vulnerabilities/srbds:Mitigation: Microcode /sys/devices/system/cpu/vulnerabilities/tsx_async_abort:Mitigation: Clear CPU buffers; SMT vulnerable
shiwanibiradar fedora32 kvm ram2gb cpu 1 [1] 1. all test passed . only ./default/libhugetlbfs SKIP ./default/paxtest SKIP
smearumi Lenovo G40; CPU: 4 x Intel(R) Core(TM) i5-5200U CPU @ 2.20GHz; GPU: [Advanced Micro Devices, Inc. [AMD/ATI], Intel(R) HD Graphics 5500 (Broadwell GT2)] Memory: 7.7 GiB of RAM; OS: Linux Fedora 31; Kernel: 5.6.18-200.fc31.x86_64 [1] 1. [Test suite called with default - {./default/modsign [PASS]}; {./default/memfd [PASS]}; {./default/mq-memory-corruption [PASS]}; {./default/libhugetlbfs [SKIP]}; {./default/insert_leap_second [PASS]}; {./default/selinux-dac-controls [PASS]}; {./default/timer-overhead [PASS]}; {./default/posix_timers [PASS]}; {./default/cachedrop [PASS]}; {./default/stack-randomness [PASS]}; {./default/sysfs-perms [PASS]}; {./default/paxtest [SKIP]};] [{5511MB [OK]}; {5511MB [OK]}; {5511MB [OK]}; {Using config in CONFIG.localhost.localdomain}; {Tue 23 Jun 2020 07:30:54 PM +06}; {Latency measurements}; {Tue 23 Jun 2020 07:31:11 PM +06}; {Calculating file system latency}; {Tue 23 Jun 2020 07:31:14 PM +06}; {Local networking}; {Tue 23 Jun 2020 07:34:55 PM +06}; {Bandwidth measurements}; {Tue 23 Jun 2020 07:39:27 PM +06}; {Calculating context switch overhead}; {Tue 23 Jun 2020 07:39:31 PM +06};] [{./performance/lmbench3 [PASS]}] [{Test suite complete [PASS]}] [Vulnerability status: {/sys/devices/system/cpu/vulnerabilities/itlb_multihit:KVM: Mitigation: Split huge pages}; {/sys/devices/system/cpu/vulnerabilities/l1tf:Mitigation: PTE Inversion; VMX: conditional cache flushes, SMT vulnerable}; {/sys/devices/system/cpu/vulnerabilities/mds:Mitigation: Clear CPU buffers; SMT vulnerable}; {/sys/devices/system/cpu/vulnerabilities/meltdown:Mitigation: PTI}; {/sys/devices/system/cpu/vulnerabilities/spec_store_bypass:Mitigation: Speculative Store Bypass disabled via prctl and seccomp}; {/sys/devices/system/cpu/vulnerabilities/spectre_v1:Mitigation: usercopy/swapgs barriers and __user pointer sanitization}; {/sys/devices/system/cpu/vulnerabilities/spectre_v2:Mitigation: Full generic retpoline, IBPB: conditional, IBRS_FW, STIBP: conditional, RSB filling}; {/sys/devices/system/cpu/vulnerabilities/srbds:Vulnerable: No microcode}; {/sys/devices/system/cpu/vulnerabilities/tsx_async_abort:Not affected};]
stathisl ASUS X571G, intel i5-9300H running on Boxes with 8 cores and 4GB assigned and 21.5GB [1] 1. Test suite called with default: ./default/cachedrop PASS ./default/paxtest SKIP ./default/posix_timers PASS ./default/libhugetlbfs SKIP ./default/insert_leap_second PASS ./default/modsign PASS ./default/mq-memory-corruption PASS ./default/selinux-dac-controls PASS ./default/sysfs-perms PASS ./default/timer-overhead PASS ./default/stack-randomness PASS ./default/memfd PASS Test suite complete PASS
sumantrom Kernel 5.7 Test Image on KVM [1] 1. /sys/devices/system/cpu/vulnerabilities/itlb_multihit:KVM: Mitigation: Split huge pages /sys/devices/system/cpu/vulnerabilities/l1tf:Mitigation: PTE Inversion; VMX: flush not necessary, SMT disabled /sys/devices/system/cpu/vulnerabilities/mds:Mitigation: Clear CPU buffers; SMT Host state unknown /sys/devices/system/cpu/vulnerabilities/meltdown:Mitigation: PTI /sys/devices/system/cpu/vulnerabilities/spec_store_bypass:Mitigation: Speculative Store Bypass disabled via prctl and seccomp /sys/devices/system/cpu/vulnerabilities/spectre_v1:Mitigation: usercopy/swapgs barriers and __user pointer sanitization /sys/devices/system/cpu/vulnerabilities/spectre_v2:Mitigation: Full generic retpoline, IBPB: conditional, IBRS_FW, STIBP: disabled, RSB filling /sys/devices/system/cpu/vulnerabilities/srbds:Unknown: Dependent on hypervisor status /sys/devices/system/cpu/vulnerabilities/tsx_async_abort:Mitigation: Clear CPU buffers; SMT Host state unknown
sumantrom baremetal t460s i7 16GB [1] 1. /sys/devices/system/cpu/vulnerabilities/itlb_multihit:KVM: Mitigation: Split huge pages /sys/devices/system/cpu/vulnerabilities/l1tf:Mitigation: PTE Inversion; VMX: conditional cache flushes, SMT vulnerable /sys/devices/system/cpu/vulnerabilities/mds:Mitigation: Clear CPU buffers; SMT vulnerable /sys/devices/system/cpu/vulnerabilities/meltdown:Mitigation: PTI /sys/devices/system/cpu/vulnerabilities/spec_store_bypass:Mitigation: Speculative Store Bypass disabled via prctl and seccomp /sys/devices/system/cpu/vulnerabilities/spectre_v1:Mitigation: usercopy/swapgs barriers and __user pointer sanitization /sys/devices/system/cpu/vulnerabilities/spectre_v2:Mitigation: Full generic retpoline, IBPB: conditional, IBRS_FW, STIBP: conditional, RSB filling /sys/devices/system/cpu/vulnerabilities/srbds:Vulnerable: No microcode /sys/devices/system/cpu/vulnerabilities/tsx_async_abort:Mitigation: Clear CPU buffers; SMT vulnerable
susgupta CPU: Intel Core (Skylake, IBRS) @ 2.904GHz, GPU: llvmpipe (LLVM 10.0.0, 256 bits) [1] 1. /sys/devices/system/cpu/vulnerabilities/itlb_multihit:KVM: Mitigation: Split huge pages /sys/devices/system/cpu/vulnerabilities/l1tf:Mitigation: PTE Inversion; VMX: conditional cache flushes, SMT disabled /sys/devices/system/cpu/vulnerabilities/mds:Mitigation: Clear CPU buffers; SMT Host state unknown /sys/devices/system/cpu/vulnerabilities/meltdown:Mitigation: PTI /sys/devices/system/cpu/vulnerabilities/spec_store_bypass:Mitigation: Speculative Store Bypass disabled via prctl and seccomp /sys/devices/system/cpu/vulnerabilities/spectre_v1:Mitigation: usercopy/swapgs barriers and __user pointer sanitization /sys/devices/system/cpu/vulnerabilities/spectre_v2:Mitigation: Full generic retpoline, IBPB: conditional, IBRS_FW, STIBP: disabled, RSB filling /sys/devices/system/cpu/vulnerabilities/srbds:Unknown: Dependent on hypervisor status /sys/devices/system/cpu/vulnerabilities/tsx_async_abort:Mitigation: Clear CPU buffers; SMT Host state unknown
szydell Dell 6430U, Intel i7-3687U, 16GB ram [1] 1. libtirpc-devel is missing in the live kernel test image
szydell Dell Inspiron 5000, Intel i7-6500U, 16GB ram
szydell System76 oryp4, Intel i7-8750H, 32GB ram
temjin747 Host: Fedora 32 KDE Spin x86_64 kernel 5.6.19-300.fc32.x86_64 running on HP Envy x360, AMD Ryzen 5 2500U APU. VM: Test Day Image on QEMU-KVM version 4.2.0/KVM (2 vCPUs, 2 GB RAM)
tharadash Dell Vostro 5471 [1] 1. Every test either passed or skipped. No bugs to report so far.
tharadash GA-Z77-D3H, i7-3770K, GTX 980 [1] 1. Every test either passed or skipped. No bugs to report so far.
tharadash HP ENVY X360, Ryzen 5 3500U [1] 1. Every test either passed or skipped. No bugs to report so far.
tharadash Intel NUC DC53427HYE [1] 1. Every test either skipped or passed. No bugs to report so far.
theadisoni Arch(x86_64), CPU on mode(s)-32,64bit,cpu-1,core-1,socket-1,cpu_mhz-2000.000,bogo_mips-4000.00, hypervisor_vendor(VMware),
thilellidotnet Testing: kerneltest-5.7.5.iso Model: Lenovo Y50-70 Processor: Intel Core i7-4710HQ CPU @ 2.50GHz Memory: 16 GB Storage: 512 GB SSD Graphic subsystem: Lenovo GM107M [GeForce GTX 860M] (kernel modules: nvidiafb, nouveau) Graphic subsystem: Lenovo 4th Gen Core Processor Integrated Graphics Controller (kernel modules: i915) [1] 1. Test suite complete (paxtest and libhugetlbfs skipped): PASS Test suite performance complete: PASS Have to be run as root for all/most tests to complete (sudo isn't sufficient) Have to install libtirpc-devel, and add the execution bit on some scripts for 'performance' mode to complete
tseewald Dell Latitude 7490 (Intel i7-8650U, UHD 620, 16GB RAM) [1] 1. All tests passed.
uriandwubber
vladis 6x i7-6820HQ @ 2.70GHz / 8Gb RAM KVM VM on Fedora32 [1] 1. # ./runtests.sh Test suite called with default ./default/cachedrop PASS ./default/insert_leap_second SKIP ./default/libhugetlbfs SKIP ./default/memfd PASS ./default/modsign SKIP ./default/mq-memory-corruption PASS ./default/paxtest SKIP ./default/posix_timers PASS ./default/selinux-dac-controls PASS ./default/stack-randomness PASS ./default/sysfs-perms PASS ./default/timer-overhead PASS Test suite complete PASS Your log file is being submitted... Upload successful! # ./runtests.sh -t performance Test suite called with performance Latency measurements Calculating file system latency Local networking Bandwidth measurements Calculating context switch overhead x86_64-linux-gnu: using 0.004096 size for reread timing ./performance/lmbench3 PASS Test suite complete PASS Your log file is being submitted... Upload successful!
vladis Lenovo P50 (8x Intel(R) Core(TM) i7-6820HQ CPU @ 2.70GHz / 32Gb RAM / 500G Samsung NVMe) [1] 1. 1) First run has "./default/cachedrop" test failed, second run and run after reboot were fine: # ./runtests.sh Test suite called with default ... ./default/cachedrop FAIL 2) test image "kerneltest-5.7.4.iso" (for testing on bare-metal systems) has getlist and getsummary scripts without exec bits: [kernel-tests]# ls -la ./performance/lmbench3/scripts/getlist ./performance/lmbench3/scripts/getsummary -rw-r--r--. 1 liveuser liveuser 633 Jun 19 19:50 ./performance/lmbench3/scripts/getlist -rw-r--r--. 1 liveuser liveuser 27446 Jun 19 19:50 ./performance/lmbench3/scripts/getsummary so they fail to run at the end of performance tests: Bandwidth measurements Calculating context switch overhead /bin/sh: ../scripts/getlist: Permission denied /bin/sh: ../scripts/getsummary: Permission denied make: *** [Makefile:110: summary] Error 126 ./performance/lmbench3 PASS Test suite complete PASS so i had to manually give them +x perms beforehand. 3) so, the second attempt was ok, logs: # ./runtests.sh Test suite called with default ./default/timer-overhead PASS ./default/sysfs-perms PASS ./default/posix_timers PASS ./default/paxtest SKIP ./default/memfd PASS ./default/stack-randomness PASS ./default/modsign PASS ./default/libhugetlbfs SKIP ./default/cachedrop PASS ./default/mq-memory-corruption PASS ./default/selinux-dac-controls PASS ./default/insert_leap_second PASS Test suite complete PASS # ./runtests.sh -t performance Test suite called with performance 22038MB OK 22038MB OK 22038MB OK mhz: should take approximately 30 seconds Using config in CONFIG.localhost-live Tue 23 Jun 2020 02:55:40 AM EDT Latency measurements Tue 23 Jun 2020 02:56:44 AM EDT Calculating file system latency Tue 23 Jun 2020 02:57:12 AM EDT Local networking Tue 23 Jun 2020 03:01:04 AM EDT Bandwidth measurements Tue 23 Jun 2020 03:17:35 AM EDT Calculating context switch overhead Tue 23 Jun 2020 03:18:43 AM EDT ./performance/lmbench3 PASS Test suite complete PASS
wargre core i7 7700 on z370 board [1] 1. All good
xoom Hewlett-Packard HP ProDesk 600 G1 SFF/18E7 CPU0: Intel(R) Core(TM) i3-4130 CPU @ 3.40GHz [1] 1. Test suite called with default ./default/memfd PASS ./default/posix_timers PASS ./default/sysfs-perms PASS ./default/selinux-dac-controls SKIP ./default/mq-memory-corruption PASS ./default/paxtest SKIP ./default/libhugetlbfs SKIP ./default/modsign PASS ./default/stack-randomness PASS ./default/insert_leap_second PASS ./default/cachedrop PASS ./default/timer-overhead PASS Test suite complete PASS
xoom Performance Hewlett-Packard HP ProDesk 600 G1 CPU0: Intel(R) Core(TM) i3-4130 CPU @ 3.40GHz [1] 1. 11127MB OK 11127MB OK 11127MB OK Using config in CONFIG.localhost.localdomain Fri 19 Jun 2020 05:10:41 PM CDT Latency measurements Fri 19 Jun 2020 05:11:19 PM CDT Calculating file system latency Fri 19 Jun 2020 05:11:20 PM CDT Local networking Fri 19 Jun 2020 05:15:12 PM CDT Bandwidth measurements Fri 19 Jun 2020 05:22:21 PM CDT Calculating context switch overhead Fri 19 Jun 2020 05:22:26 PM CDT ./performance/lmbench3 PASS Test suite complete PASS
yanqiyu Hyper-V VM [1] 1. ./default/cachedrop FAIL others passed 5.7.4-200.fc32
yevgensm Toshiba Satelite pro C650-SP5016L [1] [2] [3] 1. Vulnerability status: /sys/devices/system/cpu/vulnerabilities/itlb_multihit:KVM: Mitigation: Split huge pages /sys/devices/system/cpu/vulnerabilities/l1tf:Mitigation: PTE Inversion; VMX: conditional cache flushes, SMT vulnerable /sys/devices/system/cpu/vulnerabilities/mds:Vulnerable: Clear CPU buffers attempted, no microcode; SMT vulnerable /sys/devices/system/cpu/vulnerabilities/meltdown:Mitigation: PTI /sys/devices/system/cpu/vulnerabilities/spec_store_bypass:Mitigation: Speculative Store Bypass disabled via prctl and seccomp /sys/devices/system/cpu/vulnerabilities/spectre_v1:Mitigation: usercopy/swapgs barriers and __user pointer sanitization /sys/devices/system/cpu/vulnerabilities/spectre_v2:Mitigation: Full generic retpoline, IBPB: conditional, IBRS_FW, STIBP: conditional, RSB filling /sys/devices/system/cpu/vulnerabilities/srbds:Not affected /sys/devices/system/cpu/vulnerabilities/tsx_async_abort:Not affected
2. /sys/devices/system/cpu/vulnerabilities/itlb_multihit:KVM: Mitigation: Split huge pages /sys/devices/system/cpu/vulnerabilities/l1tf:Mitigation: PTE Inversion; VMX: conditional cache flushes, SMT vulnerable /sys/devices/system/cpu/vulnerabilities/mds:Vulnerable: Clear CPU buffers attempted, no microcode; SMT vulnerable /sys/devices/system/cpu/vulnerabilities/meltdown:Mitigation: PTI /sys/devices/system/cpu/vulnerabilities/spec_store_bypass:Mitigation: Speculative Store Bypass disabled via prctl and seccomp /sys/devices/system/cpu/vulnerabilities/spectre_v1:Mitigation: usercopy/swapgs barriers and __user pointer sanitization /sys/devices/system/cpu/vulnerabilities/spectre_v2:Mitigation: Full generic retpoline, IBPB: conditional, IBRS_FW, STIBP: conditional, RSB filling /sys/devices/system/cpu/vulnerabilities/srbds:Not affected /sys/devices/system/cpu/vulnerabilities/tsx_async_abort:Not affected
3. Vulnerability status: /sys/devices/system/cpu/vulnerabilities/itlb_multihit:KVM: Mitigation: Split huge pages /sys/devices/system/cpu/vulnerabilities/l1tf:Mitigation: PTE Inversion; VMX: conditional cache flushes, SMT vulnerable /sys/devices/system/cpu/vulnerabilities/mds:Vulnerable: Clear CPU buffers attempted, no microcode; SMT vulnerable /sys/devices/system/cpu/vulnerabilities/meltdown:Mitigation: PTI /sys/devices/system/cpu/vulnerabilities/spec_store_bypass:Mitigation: Speculative Store Bypass disabled via prctl and seccomp /sys/devices/system/cpu/vulnerabilities/spectre_v1:Mitigation: usercopy/swapgs barriers and __user pointer sanitization /sys/devices/system/cpu/vulnerabilities/spectre_v2:Mitigation: Full generic retpoline, IBPB: conditional, IBRS_FW, STIBP: conditional, RSB filling /sys/devices/system/cpu/vulnerabilities/srbds:Not affected /sys/devices/system/cpu/vulnerabilities/tsx_async_abort:Not affected
Wiki Metadata